{"text_format":"1","workbook":"xlsx","n_sheets":5,"sheets":["Tutoriel","ordre des matchs","matchs","fiche calcul","mise à jour des données"],"not_rendered":{"charts":0,"images":3,"macros":1,"external_links":0,"defined_names":20,"comments":1,"pivot_tables":0},"unopened":[],"bounds":{"document_bytes":16777216,"sheet_cells":100000,"rows_first":2000,"rows_last":500,"rows_between":2000,"halvings":0,"cell_chars":16384,"cell_head_chars":4096},"cells_cut":0,"cells_raw":0,"read":"whole","date_system":"1900"}

{"sheet":"Tutoriel","index":0,"n_rows":46,"n_cols":1,"rows_kept":46,"cut":false,"hidden":false,"merged":[]}
[]
[]
["1) Ouvrir la\" feuille ordre des matchs\""]
[]
[]
["Remplir les champs en Jaune"]
[]
[]
[]
[]
[]
[]
[]
[]
[]
[]
[]
[]
[]
[]
[]
["Remplir les scores de chaque matchs dans la feuille \"ordre des matchs\""]
[]
[]
[]
[]
[]
[]
[]
[]
[]
[]
[]
[]
[]
[]
[]
[]
[]
[]
[]
[]
["Les résultats et classements sont affichés automatiquement dans l'onglet \"matchs\""]
[]
[]
["2) "]

{"sheet":"ordre des matchs","index":1,"n_rows":56,"n_cols":50,"rows_kept":56,"cut":false,"hidden":false,"merged":[[0,2,2,26],[0,38,2,48],[3,2,3,26],[3,38,3,48],[4,4,5,6],[4,8,5,10],[4,12,5,14],[4,16,5,18],[4,20,5,22],[4,24,5,26],[4,41,6,41],[4,42,6,42],[6,4,6,6],[6,8,6,10],[6,12,6,14],[6,16,6,18],[23,37,26,37],[11,37,14,37],[15,20,15,22],[15,37,18,37],[19,37,22,37],[4,47,6,47],[4,48,6,48],[7,37,10,37],[9,16,9,18],[9,24,9,26],[4,28,5,30],[4,32,5,34],[4,38,6,38],[4,39,6,39],[4,40,6,40],[4,43,5,46],[6,20,6,22],[6,24,6,26],[6,28,6,30],[6,32,6,34],[39,4,39,6],[21,16,21,18],[21,24,21,26],[27,4,27,6],[27,12,27,14],[27,20,27,22],[46,8,46,10],[46,32,46,34],[52,8,52,10],[52,28,52,30],[27,37,30,37],[31,37,34,37],[33,8,33,10],[35,37,38,37]]}
[null,null,"TERMINALES     ORDRE DES MATCHS  pour l'évaluation",null,null,null,null,null,null,null,null,null,null,null,null,null,null,null,null,null,null,null,null,null,null,null,null,null,null,null,null,null,null,null,null,null,null,null,"TERMINALES     Classement pour l'évaluation"]
[]
[]
[null,null,null,null,null,null,null,null,null,null,null,null,null,null,null,null,null,null,null,null,null,null,null,null,null,null,null,null,null,null,null,null,null,null,null,null,null,null,"REMPLIR LES CHAMPS EN JAUNE"]
[null,null,null,null,"1°période de jeu    8h40",null,null,null,"2°période de jeu   8h50",null,null,null,"3°période de jeu  9h05",null,null,null,"4°période de jeu  9h15",null,null,null,"5°période de jeu    9h25",null,null,null,"6°période de jeu   9h35",null,null,null,"7°période de jeu   ",null,null,null,"8°période de jeu   ",null,null,null,null,null,"Classemnt","NOM","PRENOM","SEXE","POULE","Points par rencontre",null,null,null,"Total","Classemnt final"]
[]
[null,null,null,null,"10H20",null,null,null,"10H35",null,null,null,"10H50",null,null,null,"11H05",null,null,null,"11H20",null,null,null,"11H35",null,null,null,"11H50",null,null,null,"12H00",null,null,null,null,null,null,null,null,null,null,"1°","2°","3°","4°"]
[1,{"$f":"AN8","v":0},"1°","Rencontre",1,"x",2,null,null,null,null,null,2,"x",3,null,null,null,null,null,3,"x",1,null,null,null,null,null,null,null,null,null,null,null,null,null,null,"T1",1,null,null,"G",1,null,null,null,null,{"$f":"SUM(AR8:AU8)","v":0},{"$f":"AV8","v":0},1]
[{"$f":"A8+1","v":2},{"$f":"AN9","v":0},null,"1er SET",2,"à",6,null,null,null,null,null,7,"à",2,null,null,null,null,null,3,"à",10,null,null,null,null,null,null,null,null,null,null,null,null,null,null,null,{"$f":"AM8+1","v":2},null,null,"G",1,null,null,null,null,{"$f":"SUM(AR9:AU9)","v":0},0,{"$f":"AX8+1","v":2}]
[{"$f":"A9+1","v":3},{"$f":"AN10","v":0},null,"2ème SET",8,"à",4,null,null,null,null,null,8,"à",4,null,null,null,null,null,5,"à",9,null,null,null,null,null,null,null,null,null,null,null,null,null,null,null,3,null,null,"G",1,null,null,null,null,0,0,3]
[{"$f":"A10+1","v":4},{"$f":"AN11","v":0},"2°","Rencontre",3,"x",4,null,null,null,null,null,4,"x",1,null,null,null,null,null,4,"x",2,null,null,null,null,null,null,null,null,null,null,null,null,null,null,null,4,null,null,"G",1,null,null,null,null,0,0,4]
[null,null,null,"1er SET",5,"à",6,null,null,null,null,null,3,"à",15,null,null,null,null,null,6,"à",5,null,null,null,null,null,null,null,null,null,null,null,null,null,null,"T2",5,null,null,"G",2,null,null,null,null,0,0,5]
[null,null,null,"2ème SET",6,"à",5,null,null,null,null,null,5,"à",6,null,null,null,null,null,6,"à",5,null,null,null,null,null,null,null,null,null,null,null,null,null,null,null,6,null,null,"F",2,null,null,null,null,0,0,6]
[5,{"$f":"AN12","v":0},"1°","Rencontre",null,null,null,null,5,"x",6,null,null,null,null,null,6,"x",7,null,null,null,null,null,7,"x",5,null,null,null,null,null,null,null,null,null,null,null,7,null,null,"F",2,null,null,null,null,0,0,7]
[6,{"$f":"AN13","v":0},null,"1er SET",null,null,null,null,7,"à",4,null,null,null,null,null,8,"à",11,null,null,null,null,null,5,"à",11,null,null,null,null,null,null,null,null,null,null,null,8,null,null,"G",2,null,null,null,null,0,0,8]
[7,{"$f":"AN14","v":0},null,"2ème SET",null,null,null,null,5,"à",6,null,null,null,null,null,7,"à",8,null,null,null,null,null,1,"à",7,null,null,null,null,null,null,null,null,null,null,"T3",9,null,null,"G",3,null,null,null,null,0,0,9]
[8,0,"2°","Rencontre",null,null,null,null,7,"x",8,null,null,null,null,null,8,"x",5,null,null,null,null,null,8,"x",6,null,null,null,null,null,null,null,null,null,null,null,10,null,null,"G",3,null,null,null,null,0,0,10]
[null,null,null,"1er SET",null,null,null,null,7,"à",5,null,null,null,null,null,3,"à",9,null,null,null,null,null,5,"à",6,null,null,null,null,null,null,null,null,null,null,null,11,null,null,"F",3,null,null,null,null,0,0,11]
[null,null,null,"2ème SET",null,null,null,null,8,"à",5,null,null,null,null,null,5,"à",10,null,null,null,null,null,3,"à",3,null,null,null,null,null,null,null,null,null,null,null,12,null,null,"G",3,null,null,null,null,0,0,12]
[9,{"$f":"AN16","v":0},"1°","Rencontre",11,"x",9,null,null,null,null,null,9,"x",10,null,null,null,null,null,12,"x",9,null,null,null,null,null,null,null,null,null,null,null,null,null,null,"T5",13,null,null,"G",4,null,null,null,null,0,0,13]
[{"$f":"A20+1","v":10},{"$f":"AN17","v":0},null,"1er SET",4,"à",8,null,null,null,null,null,6,"à",7,null,null,null,null,null,5,"à",7,null,null,null,null,null,null,null,null,null,null,null,null,null,null,null,14,null,null,"G",4,null,null,null,null,0,0,14]
[{"$f":"A21+1","v":11},0,null,"2ème SET",2,"à",12,null,null,null,null,null,6,"à",8,null,null,null,null,null,7,"à",6,null,null,null,null,null,null,null,null,null,null,null,null,null,null,null,15,null,null,"F",4,null,null,null,null,0,0,15]
[{"$f":"A22+1","v":12},0,"2°","Rencontre",12,"x",10,null,null,null,null,null,11,"x",12,null,null,null,null,null,11,"x",10,null,null,null,null,null,null,null,null,null,null,null,null,null,null,null,16,null,null,"F",4,null,null,null,null,0,0,16]
[null,null,null,"1er SET",3,"à",8,null,null,null,null,null,6,"à",7,null,null,null,null,null,2,"à",3,null,null,null,null,null,null,null,null,null,null,null,null,null,null,"T6",17,null,null,"F",5,null,null,null,null,0,0,17]
[null,null,null,"2ème SET",4,"à",7,null,null,null,null,null,3,"à",6,null,null,null,null,null,2,"à",10,null,null,null,null,null,null,null,null,null,null,null,null,null,null,null,18,null,null,"G",5,null,null,null,null,0,0,18]
[13,{"$f":"AN20","v":0},"1°","Rencontre",null,null,null,null,14,"x",15,null,null,null,null,null,13,"x",14,null,null,null,null,null,13,"x",15,null,null,null,null,null,null,null,null,null,null,null,19,null,null,"F",5,null,null,null,null,0,0,19]
[{"$f":"A26+1","v":14},{"$f":"AN21","v":0},null,"1er SET",null,null,null,null,9,"à",2,null,null,null,null,null,8,"à",7,null,null,null,null,null,9,"à",2,null,null,null,null,null,null,null,null,null,null,null,20,null,null,"F",5,null,null,null,null,0,0,20]
[{"$f":"A27+1","v":15},0,null,"2ème SET",null,null,null,null,10,"à",2,null,null,null,null,null,6,"à",5,null,null,null,null,null,6,"à",2,null,null,null,null,null,null,null,null,null,null,"T7",21,null,null,"F",6,null,null,null,null,0,0,21]
[{"$f":"A28+1","v":16},0,"2°","Rencontre",null,null,null,null,16,"x",13,null,null,null,null,null,15,"x",16,null,null,null,null,null,14,"x",16,null,null,null,null,null,null,null,null,null,null,null,22,null,null,"F",6,null,{"$f":"+AS25:AV29","v":0},null,null,0,0,22]
[null,null,null,"1er SET",null,null,null,null,5,"à",5,null,null,null,null,null,3,"à",7,null,null,null,null,null,10,"à",2,null,null,null,null,null,null,null,null,null,null,null,23,null,null,"G",6,null,null,null,null,0,0,23]
[null,null,null,"2ème SET",null,null,null,null,1,"à",12,null,null,null,null,null,5,"à",6,null,null,null,null,null,6,"à",2,null,null,null,null,null,null,null,null,null,null,null,24,null,null,"G",6,null,null,null,null,0,0,24]
[17,{"$f":"AN24","v":0},"1°","Rencontre",17,"x",20,null,null,null,null,null,18,"x",20,null,null,null,null,null,17,"x",18,null,null,null,null,null,null,null,null,null,null,null,null,null,null,"T8",25,null,null,"F",7,null,null,null,null,0,0,25]
[18,{"$f":"AN25","v":0},null,"1er SET",5,"à",6,null,null,null,null,null,7,"à",8,null,null,null,null,null,4,"à",8,null,null,null,null,null,null,null,null,null,null,null,null,null,null,null,26,null,null,"F",7,null,null,null,null,0,0,26]
[19,0,null,"2ème SET",9,"à",3,null,null,null,null,null,5,"à",6,null,null,null,null,null,4,"à",8,null,null,null,null,null,null,null,null,null,null,null,null,null,null,null,27,null,null,"F",7,null,null,null,null,0,0,27]
[20,0,"2°","Rencontre",19,"x",18,null,null,null,null,null,17,"x",19,null,null,null,null,null,19,"x",20,null,null,null,null,null,null,null,null,null,null,null,null,null,null,null,28,null,null,"F",7,null,null,null,null,0,0,28]
[null,null,null,"1er SET",3,"à",9,null,null,null,null,null,13,"à",3,null,null,null,null,null,7,"à",4,null,null,null,null,null,null,null,null,null,null,null,null,null,null,"T9",29,null,null,null,8,null,null,null,null,0,0,29]
[null,null,null,"2ème SET",11,"à",3,null,null,null,null,null,6,"à",5,null,null,null,null,null,7,"à",5,null,null,null,null,null,null,null,null,null,null,null,null,null,null,null,30,null,null,null,8,null,null,null,null,0,0,30]
[21,{"$f":"AN28","v":0},"1°","Rencontre",null,null,null,null,22,"x",23,null,null,null,null,null,22,"x",24,null,null,null,null,null,21,"x",22,null,null,null,null,null,null,null,null,null,null,null,31,null,null,null,8,null,null,null,null,0,0,31]
[22,{"$f":"AN29","v":0},null,"1er SET",null,null,null,null,6,"à",5,null,null,null,null,null,6,"à",5,null,null,null,null,null,null,"à",null,null,null,null,null,null,null,null,null,null,null,null,32,null,null,null,null,null,null,null,null,0,0,32]
[23,0,null,"2ème SET",null,null,null,null,3,"à",9,null,null,null,null,null,3,"à",8,null,null,null,null,null,null,"à",null,null,null,null,null,null,null,null,null,null,null,null,33]
[24,0,"2°","Rencontre",null,null,null,null,24,"x",21,null,null,null,null,null,23,"x",21,null,null,null,null,null,23,"x",24,null,null,null,null,null,null,null,null,null,null,null,34]
[null,null,null,"1er SET",null,null,null,null,7,"à",1,null,null,null,null,null,9,"à",5,null,null,null,null,null,null,"à"]
[null,null,null,"2ème SET",null,null,null,null,7,"à",5,null,null,null,null,null,7,"à",3,null,null,null,null,null,null,"à"]
[]
[25,{"$f":"AN32","v":0},"1°","Rencontre",26,"x",27,null,null,null,null,null,null,null,null,null,26,"x",28,null,null,null,null,null,null,null,null,null,25,"x",26]
[26,{"$f":"AN33","v":0},null,"1er SET",3,"à",7,null,null,null,null,null,null,null,null,null,3,null,7,null,null,null,null,null,null,null,null,null,7,"à",1]
[27,0,null,"2ème SET",8,"à",2,null,null,null,null,null,null,null,null,null,4,"à",6,null,null,null,null,null,null,null,null,null,5,"à",3]
[28,0,"2°","Rencontre",25,"x",28,null,null,null,null,null,null,null,null,null,27,"x",25,null,null,null,null,null,null,null,null,null,27,"x",28]
[null,null,null,"1er SET",7,"à",6,null,null,null,null,null,null,null,null,null,2,"à",7,null,null,null,null,null,null,null,null,null,3,"à",5]
[null,null,null,"2ème SET",6,"à",4,null,null,null,null,null,null,null,null,null,3,"à",8,null,null,null,null,null,null,null,null,null,6,"à",3]
[29,{"$f":"AN36","v":0},"1°","Rencontre",null,null,null,null,null,null,null,null,30,"x",31,null,null,null,null,null,30,"x",32,null,null,null,null,null,null,null,null,null,29,"x",30]
[30,{"$f":"AN37","v":0},null,"1er SET",null,null,null,null,null,null,null,null,null,"à",null,null,null,null,null,null,null,"à",null,null,null,null,null,null,null,null,null,null,null,"à"]
[31,0,null,"2ème SET",null,null,null,null,null,null,null,null,null,"à",null,null,null,null,null,null,null,"à",null,null,null,null,null,null,null,null,null,null,null,"à"]
[32,0,"2°","Rencontre",null,null,null,null,null,null,null,null,29,"x",32,null,null,null,null,null,29,"x",31,null,null,null,null,null,null,null,null,null,31,"x",32]
[null,null,null,"1er SET",null,null,null,null,null,null,null,null,null,"à",null,null,null,null,null,null,null,"à",null,null,null,null,null,null,null,null,null,null,null,"à"]
[null,null,null,"2ème SET",null,null,null,null,null,null,null,null,null,"à",null,null,null,null,null,null,null,"à",null,null,null,null,null,null,null,null,null,null,null,"à"]

{"sheet":"matchs","index":2,"n_rows":56,"n_cols":132,"rows_kept":56,"cut":false,"hidden":false,"merged":[[4,108,4,117],[4,120,4,129],[1,78,1,82],[4,80,4,82],[3,72,3,82],[4,72,5,72],[5,52,5,53],[1,17,1,27],[1,28,1,38],[4,75,5,75],[5,63,5,64],[5,50,5,51],[3,6,3,64],[5,61,5,62],[5,17,5,18],[5,28,5,29],[5,30,5,31],[5,41,5,42],[5,19,5,20],[5,6,5,7],[5,8,5,9],[5,39,5,40],[0,0,0,3],[3,2,3,4],[1,50,1,60],[0,96,0,105],[1,61,1,71],[2,6,2,71],[1,72,1,75],[1,39,1,49],[1,6,1,16]]}
["Ne pas modifier l'ordre des élèves",null,null,null,null,null,null,null,null,null,null,null,null,null,null,null,null,null,null,null,null,null,null,null,null,null,null,null,null,null,null,null,null,null,null,null,null,null,null,null,null,null,null,null,null,null,null,null,null,null,null,null,null,null,null,null,null,null,null,null,null,null,null,null,null,null,null,null,null,null,null,null,null,null,null,null,null,null,null,null,null,null,null,null,null,null,null,null,null,null,null,null,null,null,null,null,"Poules"]
[null,null,null,null,null,null,"Match 1",null,null,null,null,null,null,null,null,null,null,"Match 2",null,null,null,null,null,null,null,null,null,null,"Match 3",null,null,null,null,null,null,null,null,null,null,"Match 4",null,null,null,null,null,null,null,null,null,null,"Match 5",null,null,null,null,null,null,null,null,null,null,"Match 6",null,null,null,null,null,null,null,null,null,null,"RESULTAT",null,null,null,null,null,"CLASSEMENT",null,null,null,null,null,null,null,null,null,null,null,null,null,null,null,null,null,1,2,3,4,5,6,7,8,9,10]
[null,null,null,null,null,null,null,null,null,null,null,null,null,null,null,null,null,null,null,null,null,null,null,null,null,null,null,null,null,null,null,null,null,null,null,null,null,null,null,null,null,null,null,null,null,null,null,null,null,null,null,null,null,null,null,null,null,null,null,null,null,null,null,null,null,null,null,null,null,null,null,null,null,null,null,null,null,null,null,null,null,null,null,null,null,null,null,null,null,null,null,null,null,null,null,null,{"$f":"COUNTIF($F$7:$F$44,CS2)","v":4},{"$f":"COUNTIF($F$7:$F$44,CT2)","v":4},4,4,4,4,4,3,0,0]
[null,null,"J = joueur  et  A = Adversaire",null,null,null,"POINTS",null,null,null,null,null,null,null,null,null,null,null,null,null,null,null,null,null,null,null,null,null,null,null,null,null,null,null,null,null,null,null,null,null,null,null,null,null,null,null,null,null,null,null,null,null,null,null,null,null,null,null,null,null,null,null,null,null,null,null,null,null,null,null,null,null,"RESULTATS",null,null,null,null,null,null,null,null,null,null,null,null,null,null,null,null,null,null,null,null,null,null,null,{"$f":"IF(CS3=0,\"\",CS3/3)","v":1.3333333333333333},{"$f":"IF(CT3=0,\"\",CT3/3)","v":1.3333333333333333},1.3333333333333333,1.3333333333333333,1.3333333333333333,1.3333333333333333,1.3333333333333333,1,"",""]
[null,null,null,null,null,null,"J","A","J","A",null,null,null,null,null,null,null,"J","A","J","A",null,null,null,null,null,null,null,"J","A","J","A",null,null,null,null,null,null,null,"J","A","J","A",null,null,null,null,null,null,null,"J","A","J","A",null,null,null,null,null,null,null,"J","A","J","A",null,null,null,null,null,null,null,"Sets\ngagnés",null,null,"Matchs\njoués",null,null,null,null,"Général",null,null,null,null,null,null,null,null,null,null,null,null,null,null,null,{"$f":"IF(CS3=0,\"\",CS3*2/3)","v":2.6666666666666665},{"$f":"IF(CT3=0,\"\",CT3*2/3)","v":2.6666666666666665},2.6666666666666665,2.6666666666666665,2.6666666666666665,2.6666666666666665,2.6666666666666665,2,"","","Note",null,"Filles",null,null,null,null,null,null,null,null,null,"F",null,"Garçons",null,null,null,null,null,null,null,null,null,"G"]
["N°","classe","NOM","PRENOM","sexe","poule","Set 1",null,"Set 2",null,null,null,null,null,null,null,"cas","Set 1",null,"Set 2",null,null,null,null,null,null,null,"cas","Set 1",null,"Set 2",null,null,null,null,null,null,null,"cas","Set 1",null,"Set 2",null,null,null,null,null,null,null,"cas","Set 1",null,"Set 2",null,null,null,null,null,null,null,"cas","Set 1",null,"Set 2",null,null,null,null,null,null,null,"cas",null,null,"Points",null,null,null,"Poule",null,"F",null,"G",null,null,null,null,null,null,null,null,null,null,null,null,null,null,null,null,null,null,null,null,null,null,null,null,"P0","P1","P2","P3","P4","P5","P6","P7","P8","P9","P10",null,"P0","P1","P2","P3","P4","P5","P6","P7","P8","P9","P10",null,"place"]
[1,null,{"$f":"'ordre des matchs'!AN8","v":0},{"$f":"'ordre des matchs'!AO8","v":0},{"$f":"'ordre des matchs'!AP8","v":"G"},{"$f":"'ordre des matchs'!AQ8","v":1},{"$f":"'ordre des matchs'!E9","v":2},{"$f":"'ordre des matchs'!G9","v":6},{"$f":"'ordre des matchs'!E10","v":8},{"$f":"'ordre des matchs'!G10","v":4},{"$f":"IF(COUNT(G7:H7)<2,\"\",G7-H7)","v":-4},{"$f":"IF(COUNT(I7:J7)<2,\"\",I7-J7)","v":4},{"$f":"IF(COUNT(I7:J7)<2,\"\",L7-K7)","v":8},{"$f":"IF(K7=\"\",\"\",IF(K7=0,\"\",IF(K7>0,\"G\",\"P\")))","v":"P"},{"$f":"IF(L7=\"\",\"\",IF(L7=0,\"\",IF(L7>0,\"G\",\"P\")))","v":"G"},{"$f":"IF(M7=\"\",\"\",IF(M7=0,\"P\",IF(M7>0,\"G\",\"P\")))","v":"G"},{"$f":"IF(COUNT(G7:J7)<4,\"\",IF(AND(N7=\"G\",O7=\"G\",P7=\"G\"),\"cas6\",IF(AND(N7=\"G\",O7=\"G\",P7=\"P\"),\"cas5\",IF(AND(N7=\"P\",O7=\"G\",P7=\"G\"),\"cas4\",IF(AND(N7=\"G\",O7=\"P\",P7=\"P\"),\"cas3\",IF(AND(N7=\"P\",O7=\"P\",L7>=K7+2),\"cas2\",IF(AND(N7=\"P\",O7=\"P\",L7<=K7+1),\"cas1\",\"\")))))))","v":"cas4"},{"$f":"'ordre des matchs'!O12","v":15},{"$f":"'ordre des matchs'!M12","v":3},{"$f":"'ordre des matchs'!O13","v":6},{"$f":"'ordre des matchs'!M13","v":5},{"$f":"IF(COUNT(R7:S7)<2,\"\",R7-S7)","v":12},{"$f":"IF(COUNT(T7:U7)<2,\"\",T7-U7)","v":1},{"$f":"IF(COUNT(T7:U7)<2,\"\",W7-V7)","v":-11},{"$f":"IF(V7=\"\",\"\",IF(V7=0,\"\",IF(V7>0,\"G\",\"P\")))","v":"G"},{"$f":"IF(W7=\"\",\"\",IF(W7=0,\"\",IF(W7>0,\"G\",\"P\")))","v":"G"},{"$f":"IF(X7=\"\",\"\",IF(X7=0,\"P\",IF(X7>0,\"G\",\"P\")))","v":"P"},{"$f":"IF(COUNT(R7:U7)<4,\"\",IF(AND(Y7=\"G\",Z7=\"G\",AA7=\"G\"),\"cas6\",IF(AND(Y7=\"G\",Z7=\"G\",AA7=\"P\"),\"cas5\",IF(AND(Y7=\"P\",Z7=\"G\",AA7=\"G\"),\"cas4\",IF(AND(Y7=\"G\",Z7=\"P\",AA7=\"P\"),\"cas3\",IF(AND(Y7=\"P\",Z7=\"P\",W7>=V7+2),\"cas2\",IF(AND(Y7=\"P\",Z7=\"P\",W7<=V7+1),\"cas1\",\"\")))))))","v":"cas5"},{"$f":"'ordre des matchs'!W9","v":10},{"$f":"'ordre des matchs'!U9","v":3},{"$f":"'ordre des matchs'!W10","v":9},{"$f":"'ordre des matchs'!U10","v":5},{"$f":"IF(COUNT(AC7:AD7)<2,\"\",AC7-AD7)","v":7},{"$f":"IF(COUNT(AE7:AF7)<2,\"\",AE7-AF7)","v":4},{"$f":"IF(COUNT(AE7:AF7)<2,\"\",AH7-AG7)","v":-3},{"$f":"IF(AG7=\"\",\"\",IF(AG7=0,\"\",IF(AG7>0,\"G\",\"P\")))","v":"G"},{"$f":"IF(AH7=\"\",\"\",IF(AH7=0,\"\",IF(AH7>0,\"G\",\"P\")))","v":"G"},{"$f":"IF(AI7=\"\",\"\",IF(AI7=0,\"P\",IF(AI7>0,\"G\",\"P\")))","v":"P"},{"$f":"IF(COUNT(AC7:AF7)<4,\"\",IF(AND(AJ7=\"G\",AK7=\"G\",AL7=\"G\"),\"cas6\",IF(AND(AJ7=\"G\",AK7=\"G\",AL7=\"P\"),\"cas5\",IF(AND(AJ7=\"P\",AK7=\"G\",AL7=\"G\"),\"cas4\",IF(AND(AJ7=\"G\",AK7=\"P\",AL7=\"P\"),\"cas3\",IF(AND(AJ7=\"P\",AK7=\"P\",AH7>=AG7+2),\"cas2\",IF(AND(AJ7=\"P\",AK7=\"P\",AH7<=AG7+1),\"cas1\",\"\")))))))","v":"cas5"},null,null,null,null,{"$f":"IF(COUNT(AN7:AO7)<2,\"\",AN7-AO7)","v":""},{"$f":"IF(COUNT(AP7:AQ7)<2,\"\",AP7-AQ7)","v":""},{"$f":"IF(COUNT(AP7:AQ7)<2,\"\",AS7-AR7)","v":""},{"$f":"IF(AR7=\"\",\"\",IF(AR7=0,\"\",IF(AR7>0,\"G\",\"P\")))","v":""},{"$f":"IF(AS7=\"\",\"\",IF(AS7=0,\"\",IF(AS7>0,\"G\",\"P\")))","v":""},{"$f":"IF(AT7=\"\",\"\",IF(AT7=0,\"P\",IF(AT7>0,\"G\",\"P\")))","v":""},{"$f":"IF(COUNT(AN7:AQ7)<4,\"\",IF(AND(AU7=\"G\",AV7=\"G\",AW7=\"G\"),\"cas6\",IF(AND(AU7=\"G\",AV7=\"G\",AW7=\"P\"),\"cas5\",IF(AND(AU7=\"P\",AV7=\"G\",AW7=\"G\"),\"cas4\",IF(AND(AU7=\"G\",AV7=\"P\",AW7=\"P\"),\"cas3\",IF(AND(AU7=\"P\",AV7=\"P\",AS7>=AR7+2),\"cas2\",IF(AND(AU7=\"P\",AV7=\"P\",AS7<=AR7+1),\"cas1\",\"\")))))))","v":""},null,null,null,null,{"$f":"IF(COUNT(AY7:AZ7)<2,\"\",AY7-AZ7)","v":""},{"$f":"IF(COUNT(BA7:BB7)<2,\"\",BA7-BB7)","v":""},{"$f":"IF(COUNT(BA7:BB7)<2,\"\",BD7-BC7)","v":""},{"$f":"IF(BC7=\"\",\"\",IF(BC7=0,\"\",IF(BC7>0,\"G\",\"P\")))","v":""},{"$f":"IF(BD7=\"\",\"\",IF(BD7=0,\"\",IF(BD7>0,\"G\",\"P\")))","v":""},{"$f":"IF(BE7=\"\",\"\",IF(BE7=0,\"P\",IF(BE7>0,\"G\",\"P\")))","v":""},{"$f":"IF(COUNT(AY7:BB7)<4,\"\",IF(AND(BF7=\"G\",BG7=\"G\",BH7=\"G\"),\"cas6\",IF(AND(BF7=\"G\",BG7=\"G\",BH7=\"P\"),\"cas5\",IF(AND(BF7=\"P\",BG7=\"G\",BH7=\"G\"),\"cas4\",IF(AND(BF7=\"G\",BG7=\"P\",BH7=\"P\"),\"cas3\",IF(AND(BF7=\"P\",BG7=\"P\",BD7>=BC7+2),\"cas2\",IF(AND(BF7=\"P\",BG7=\"P\",BD7<=BC7+1),\"cas1\",\"\")))))))","v":""},null,null,null,null,{"$f":"IF(COUNT(BJ7:BK7)<2,\"\",BJ7-BK7)","v":""},{"$f":"IF(COUNT(BL7:BM7)<2,\"\",BL7-BM7)","v":""},{"$f":"IF(COUNT(BL7:BM7)<2,\"\",BO7-BN7)","v":""},{"$f":"IF(BN7=\"\",\"\",IF(BN7=0,\"\",IF(BN7>0,\"G\",\"P\")))","v":""},{"$f":"IF(BO7=\"\",\"\",IF(BO7=0,\"\",IF(BO7>0,\"G\",\"P\")))","v":""},{"$f":"IF(BP7=\"\",\"\",IF(BP7=0,\"P\",IF(BP7>0,\"G\",\"P\")))","v":""},{"$f":"IF(COUNT(BJ7:BM7)<4,\"\",IF(AND(BQ7=\"G\",BR7=\"G\",BS7=\"G\"),\"cas6\",IF(AND(BQ7=\"G\",BR7=\"G\",BS7=\"P\"),\"cas5\",IF(AND(BQ7=\"P\",BR7=\"G\",BS7=\"G\"),\"cas4\",IF(AND(BQ7=\"G\",BR7=\"P\",BS7=\"P\"),\"cas3\",IF(AND(BQ7=\"P\",BR7=\"P\",BO7>=BN7+2),\"cas2\",IF(AND(BQ7=\"P\",BR7=\"P\",BO7<=BN7+1),\"cas1\",\"\")))))))","v":""},{"$f":"IF(COUNTIF(CF7:CQ7,\"G\")=0,\"\",COUNTIF(CF7:CQ7,\"G\"))","v":5},{"$f":"IF(BU7=\"\",\"\",BU7*1000)","v":5000},{"$f":"IF(COUNT(G7,I7,R7,T7,AC7,AE7,AN7,AP7,AY7,BA7,BJ7,BL7)=0,\"\",SUM(G7,I7,R7,T7,AC7,AE7,AN7,AP7,AY7,BA7,BJ7,BL7))","v":50},{"$f":"IF(COUNT(G7:BM7)=0,\"\",COUNT(G7,I7,R7,T7,AC7,AE7,AN7,AP7,AY7,BA7,BJ7,BL7)/2)","v":3},{"$f":"IF(COUNT(BV7:BW7)=0,\"\",SUM(BV7:BW7)/BX7)","v":1683.3333333333333},{"$f":"IF(F7=\"\",\"\",F7)","v":1},{"$f":"IF(BY7=\"\",\"\",COUNTIFS(BZ:BZ,BZ7,BY:BY,\">\"&BY7)+1)","v":1},{"$f":"IF($E7=\"F\",$BY7,\"\")","v":""},{"$f":"IF(COUNT(DE7:DN7)=0,\"\",RANK(DO7,DO$7:DO$44,1))","v":""},{"$f":"IF($E7=\"G\",$BY7,\"\")","v":1683.3333333333333},{"$f":"IF(COUNT(DQ7:DZ7)=0,\"\",RANK(EA7,EA$7:EA$44,1))","v":1},{"$f":"IF(N7=\"\",\"\",N7)","v":"P"},{"$f":"IF(O7=\"\",\"\",O7)","v":"G"},{"$f":"IF(Y7=\"\",\"\",Y7)","v":"G"},{"$f":"IF(Z7=\"\",\"\",Z7)","v":"G"},{"$f":"IF(AJ7=\"\",\"\",AJ7)","v":"G"},{"$f":"IF(AK7=\"\",\"\",AK7)","v":"G"},{"$f":"IF(AU7=\"\",\"\",AU7)","v":""},{"$f":"IF(AV7=\"\",\"\",AV7)","v":""},{"$f":"IF(BF7=\"\",\"\",BF7)","v":""},{"$f":"IF(BG7=\"\",\"\",BG7)","v":""},{"$f":"IF(BQ7=\"\",\"\",BQ7)","v":""},{"$f":"IF(BR7=\"\",\"\",BR7)","v":""},"G",{"$f":"IF($CA7=\"\",\"\",IF($F7<>CS$2,\"\",IF($CA7<CS$4+0.00001,1.5,IF($CA7>CS$5+0.00001,0.5,1))))","v":1.5},{"$f":"IF($CA7=\"\",\"\",IF($F7<>CT$2,\"\",IF($CA7<CT$4+0.00001,1.5,IF($CA7>CT$5+0.00001,0.5,1))))","v":""},"","","","","","","","",{"$f":"IF(COUNT(CS7:DB7)=0,\"\",SUM(CS7:DB7))","v":1.5},{"$f":"IF($E7=\"G\",\"\",IF($F7=\"\",\"\",IF($F7=1,$CA7,\"\")))","v":""},{"$f":"IF(DD7=\"\",\"\",RANK(DD7,DD$7:DD$44,1))","v":""},{"$f":"IF($E7=\"G\",\"\",IF($F7=\"\",\"\",IF($F7=2,$CA7+DE$45,\"\")))","v":""},{"$f":"IF($E7=\"G\",\"\",IF($F7=\"\",\"\",IF($F7=3,$CA7+SUM(DE$45:DF$45),\"\")))","v":""},{"$f":"IF($E7=\"G\",\"\",IF($F7=\"\",\"\",IF($F7=4,$CA7+SUM(DE$45:DG$45),\"\")))","v":""},{"$f":"IF($E7=\"G\",\"\",IF($F7=\"\",\"\",IF($F7=5,$CA7+SUM(DE$45:DH$45),\"\")))","v":""},{"$f":"IF($E7=\"G\",\"\",IF($F7=\"\",\"\",IF($F7=6,$CA7+SUM(DE$45:DI$45),\"\")))","v":""},{"$f":"IF($E7=\"G\",\"\",IF($F7=\"\",\"\",IF($F7=7,$CA7+SUM(DE$45:DJ$45),\"\")))","v":""},{"$f":"IF($E7=\"G\",\"\",IF($F7=\"\",\"\",IF($F7=8,$CA7+SUM(DE$45:DK$45),\"\")))","v":""},{"$f":"IF($E7=\"G\",\"\",IF($F7=\"\",\"\",IF($F7=9,$CA7+SUM(DE$45:DL$45),\"\")))","v":""},{"$f":"IF($E7=\"G\",\"\",IF($F7=\"\",\"\",IF($F7=10,$CA7+SUM(DE$45:DM$45),\"\")))","v":""},{"$f":"IF(COUNT(DE7:DN7)=0,\"\",SUM(DE7:DN7))","v":""},{"$f":"IF($E7=\"F\",\"\",IF($F7=\"\",\"\",IF($F7=1,$CA7,\"\")))","v":1},{"$f":"IF(DP7=\"\",\"\",RANK(DP7,DP$7:DP$44,1))","v":1},{"$f":"IF($E7=\"F\",\"\",IF($F7=\"\",\"\",IF($F7=2,$CA7+DQ$45,\"\")))","v":""},{"$f":"IF($E7=\"F\",\"\",IF($F7=\"\",\"\",IF($F7=3,$CA7+SUM(DQ$45:DR$45),\"\")))","v":""},{"$f":"IF($E7=\"F\",\"\",IF($F7=\"\",\"\",IF($F7=4,$CA7+SUM(DQ$45:DS$45),\"\")))","v":""},{"$f":"IF($E7=\"F\",\"\",IF($F7=\"\",\"\",IF($F7=5,$CA7+SUM(DQ$45:DT$45),\"\")))","v":""},{"$f":"IF($E7=\"F\",\"\",IF($F7=\"\",\"\",IF($F7=6,$CA7+SUM(DQ$45:DU$45),\"\")))","v":""},{"$f":"IF($E7=\"F\",\"\",IF($F7=\"\",\"\",IF($F7=7,$CA7+SUM(DQ$45:DV$45),\"\")))","v":""},{"$f":"IF($E7=\"F\",\"\",IF($F7=\"\",\"\",IF($F7=8,$CA7+SUM(DQ$45:DW$45),\"\")))","v":""},{"$f":"IF($E7=\"F\",\"\",IF($F7=\"\",\"\",IF($F7=9,$CA7+SUM(DQ$45:DX$45),\"\")))","v":""},{"$f":"IF($E7=\"F\",\"\",IF($F7=\"\",\"\",IF($F7=10,$CA7+SUM(DQ$45:DY$45),\"\")))","v":""},{"$f":"IF(COUNT(DQ7:DZ7)=0,\"\",SUM(DQ7:DZ7))","v":1},{"$f":"IF(COUNT(CC7,CE7)=0,\"\",SUM(CC7,CE7))","v":1}]
[2,null,{"$f":"'ordre des matchs'!AN9","v":0},{"$f":"'ordre des matchs'!AO9","v":0},{"$f":"'ordre des matchs'!AP9","v":"G"},{"$f":"'ordre des matchs'!AQ9","v":1},{"$f":"'ordre des matchs'!G9","v":6},{"$f":"'ordre des matchs'!E9","v":2},{"$f":"'ordre des matchs'!G10","v":4},{"$f":"'ordre des matchs'!E10","v":8},{"$f":"IF(COUNT(G8:H8)<2,\"\",G8-H8)","v":4},{"$f":"IF(COUNT(I8:J8)<2,\"\",I8-J8)","v":-4},{"$f":"IF(COUNT(I8:J8)<2,\"\",L8-K8)","v":-8},{"$f":"IF(K8=\"\",\"\",IF(K8=0,\"\",IF(K8>0,\"G\",\"P\")))","v":"G"},"P",{"$f":"IF(M8=\"\",\"\",IF(M8=0,\"P\",IF(M8>0,\"G\",\"P\")))","v":"P"},{"$f":"IF(COUNT(G8:J8)<4,\"\",IF(AND(N8=\"G\",O8=\"G\",P8=\"G\"),\"cas6\",IF(AND(N8=\"G\",O8=\"G\",P8=\"P\"),\"cas5\",IF(AND(N8=\"P\",O8=\"G\",P8=\"G\"),\"cas4\",IF(AND(N8=\"G\",O8=\"P\",P8=\"P\"),\"cas3\",IF(AND(N8=\"P\",O8=\"P\",L8>=K8+2),\"cas2\",IF(AND(N8=\"P\",O8=\"P\",L8<=K8+1),\"cas1\",\"\")))))))","v":"cas3"},{"$f":"'ordre des matchs'!M9","v":7},{"$f":"'ordre des matchs'!O9","v":2},{"$f":"'ordre des matchs'!M10","v":8},{"$f":"'ordre des matchs'!O10","v":4},{"$f":"IF(COUNT(R8:S8)<2,\"\",R8-S8)","v":5},{"$f":"IF(COUNT(T8:U8)<2,\"\",T8-U8)","v":4},{"$f":"IF(COUNT(T8:U8)<2,\"\",W8-V8)","v":-1},{"$f":"IF(V8=\"\",\"\",IF(V8=0,\"\",IF(V8>0,\"G\",\"P\")))","v":"G"},"G",{"$f":"IF(X8=\"\",\"\",IF(X8=0,\"P\",IF(X8>0,\"G\",\"P\")))","v":"P"},{"$f":"IF(COUNT(R8:U8)<4,\"\",IF(AND(Y8=\"G\",Z8=\"G\",AA8=\"G\"),\"cas6\",IF(AND(Y8=\"G\",Z8=\"G\",AA8=\"P\"),\"cas5\",IF(AND(Y8=\"P\",Z8=\"G\",AA8=\"G\"),\"cas4\",IF(AND(Y8=\"G\",Z8=\"P\",AA8=\"P\"),\"cas3\",IF(AND(Y8=\"P\",Z8=\"P\",W8>=V8+2),\"cas2\",IF(AND(Y8=\"P\",Z8=\"P\",W8<=V8+1),\"cas1\",\"\")))))))","v":"cas5"},{"$f":"'ordre des matchs'!W12","v":5},{"$f":"'ordre des matchs'!U12","v":6},{"$f":"'ordre des matchs'!W13","v":5},{"$f":"'ordre des matchs'!U13","v":6},{"$f":"IF(COUNT(AC8:AD8)<2,\"\",AC8-AD8)","v":-1},{"$f":"IF(COUNT(AE8:AF8)<2,\"\",AE8-AF8)","v":-1},{"$f":"IF(COUNT(AE8:AF8)<2,\"\",AH8-AG8)","v":0},{"$f":"IF(AG8=\"\",\"\",IF(AG8=0,\"\",IF(AG8>0,\"G\",\"P\")))","v":"P"},{"$f":"IF(AH8=\"\",\"\",IF(AH8=0,\"\",IF(AH8>0,\"G\",\"P\")))","v":"P"},{"$f":"IF(AI8=\"\",\"\",IF(AI8=0,\"P\",IF(AI8>0,\"G\",\"P\")))","v":"P"},{"$f":"IF(COUNT(AC8:AF8)<4,\"\",IF(AND(AJ8=\"G\",AK8=\"G\",AL8=\"G\"),\"cas6\",IF(AND(AJ8=\"G\",AK8=\"G\",AL8=\"P\"),\"cas5\",IF(AND(AJ8=\"P\",AK8=\"G\",AL8=\"G\"),\"cas4\",IF(AND(AJ8=\"G\",AK8=\"P\",AL8=\"P\"),\"cas3\",IF(AND(AJ8=\"P\",AK8=\"P\",AH8>=AG8+2),\"cas2\",IF(AND(AJ8=\"P\",AK8=\"P\",AH8<=AG8+1),\"cas1\",\"\")))))))","v":"cas1"},null,null,null,null,{"$f":"IF(COUNT(AN8:AO8)<2,\"\",AN8-AO8)","v":""},{"$f":"IF(COUNT(AP8:AQ8)<2,\"\",AP8-AQ8)","v":""},{"$f":"IF(COUNT(AP8:AQ8)<2,\"\",AS8-AR8)","v":""},{"$f":"IF(AR8=\"\",\"\",IF(AR8=0,\"\",IF(AR8>0,\"G\",\"P\")))","v":""},{"$f":"IF(AS8=\"\",\"\",IF(AS8=0,\"\",IF(AS8>0,\"G\",\"P\")))","v":""},{"$f":"IF(AT8=\"\",\"\",IF(AT8=0,\"P\",IF(AT8>0,\"G\",\"P\")))","v":""},{"$f":"IF(COUNT(AN8:AQ8)<4,\"\",IF(AND(AU8=\"G\",AV8=\"G\",AW8=\"G\"),\"cas6\",IF(AND(AU8=\"G\",AV8=\"G\",AW8=\"P\"),\"cas5\",IF(AND(AU8=\"P\",AV8=\"G\",AW8=\"G\"),\"cas4\",IF(AND(AU8=\"G\",AV8=\"P\",AW8=\"P\"),\"cas3\",IF(AND(AU8=\"P\",AV8=\"P\",AS8>=AR8+2),\"cas2\",IF(AND(AU8=\"P\",AV8=\"P\",AS8<=AR8+1),\"cas1\",\"\")))))))","v":""},null,null,null,null,{"$f":"IF(COUNT(AY8:AZ8)<2,\"\",AY8-AZ8)","v":""},{"$f":"IF(COUNT(BA8:BB8)<2,\"\",BA8-BB8)","v":""},{"$f":"IF(COUNT(BA8:BB8)<2,\"\",BD8-BC8)","v":""},{"$f":"IF(BC8=\"\",\"\",IF(BC8=0,\"\",IF(BC8>0,\"G\",\"P\")))","v":""},{"$f":"IF(BD8=\"\",\"\",IF(BD8=0,\"\",IF(BD8>0,\"G\",\"P\")))","v":""},{"$f":"IF(BE8=\"\",\"\",IF(BE8=0,\"P\",IF(BE8>0,\"G\",\"P\")))","v":""},{"$f":"IF(COUNT(AY8:BB8)<4,\"\",IF(AND(BF8=\"G\",BG8=\"G\",BH8=\"G\"),\"cas6\",IF(AND(BF8=\"G\",BG8=\"G\",BH8=\"P\"),\"cas5\",IF(AND(BF8=\"P\",BG8=\"G\",BH8=\"G\"),\"cas4\",IF(AND(BF8=\"G\",BG8=\"P\",BH8=\"P\"),\"cas3\",IF(AND(BF8=\"P\",BG8=\"P\",BD8>=BC8+2),\"cas2\",IF(AND(BF8=\"P\",BG8=\"P\",BD8<=BC8+1),\"cas1\",\"\")))))))","v":""},null,null,null,null,{"$f":"IF(COUNT(BJ8:BK8)<2,\"\",BJ8-BK8)","v":""},{"$f":"IF(COUNT(BL8:BM8)<2,\"\",BL8-BM8)","v":""},{"$f":"IF(COUNT(BL8:BM8)<2,\"\",BO8-BN8)","v":""},{"$f":"IF(BN8=\"\",\"\",IF(BN8=0,\"\",IF(BN8>0,\"G\",\"P\")))","v":""},{"$f":"IF(BO8=\"\",\"\",IF(BO8=0,\"\",IF(BO8>0,\"G\",\"P\")))","v":""},{"$f":"IF(BP8=\"\",\"\",IF(BP8=0,\"P\",IF(BP8>0,\"G\",\"P\")))","v":""},{"$f":"IF(COUNT(BJ8:BM8)<4,\"\",IF(AND(BQ8=\"G\",BR8=\"G\",BS8=\"G\"),\"cas6\",IF(AND(BQ8=\"G\",BR8=\"G\",BS8=\"P\"),\"cas5\",IF(AND(BQ8=\"P\",BR8=\"G\",BS8=\"G\"),\"cas4\",IF(AND(BQ8=\"G\",BR8=\"P\",BS8=\"P\"),\"cas3\",IF(AND(BQ8=\"P\",BR8=\"P\",BO8>=BN8+2),\"cas2\",IF(AND(BQ8=\"P\",BR8=\"P\",BO8<=BN8+1),\"cas1\",\"\")))))))","v":""},{"$f":"IF(COUNTIF(CF8:CQ8,\"G\")=0,\"\",COUNTIF(CF8:CQ8,\"G\"))","v":3},{"$f":"IF(BU8=\"\",\"\",BU8*1000)","v":3000},{"$f":"IF(COUNT(G8,I8,R8,T8,AC8,AE8,AN8,AP8,AY8,BA8,BJ8,BL8)=0,\"\",SUM(G8,I8,R8,T8,AC8,AE8,AN8,AP8,AY8,BA8,BJ8,BL8))","v":35},{"$f":"IF(COUNT(G8:BM8)=0,\"\",COUNT(G8,I8,R8,T8,AC8,AE8,AN8,AP8,AY8,BA8,BJ8,BL8)/2)","v":3},{"$f":"IF(COUNT(BV8:BW8)=0,\"\",SUM(BV8:BW8)/BX8)","v":1011.6666666666666},{"$f":"IF(F8=\"\",\"\",F8)","v":1},2,{"$f":"IF($E8=\"F\",$BY8,\"\")","v":""},{"$f":"IF(COUNT(DE8:DN8)=0,\"\",RANK(DO8,DO$7:DO$44,1))","v":""},{"$f":"IF($E8=\"G\",$BY8,\"\")","v":1011.6666666666666},{"$f":"IF(COUNT(DQ8:DZ8)=0,\"\",RANK(EA8,EA$7:EA$44,1))","v":2},{"$f":"IF(N8=\"\",\"\",N8)","v":"G"},{"$f":"IF(O8=\"\",\"\",O8)","v":"P"},{"$f":"IF(Y8=\"\",\"\",Y8)","v":"G"},{"$f":"IF(Z8=\"\",\"\",Z8)","v":"G"},{"$f":"IF(AJ8=\"\",\"\",AJ8)","v":"P"},{"$f":"IF(AK8=\"\",\"\",AK8)","v":"P"},{"$f":"IF(AU8=\"\",\"\",AU8)","v":""},{"$f":"IF(AV8=\"\",\"\",AV8)","v":""},{"$f":"IF(BF8=\"\",\"\",BF8)","v":""},{"$f":"IF(BG8=\"\",\"\",BG8)","v":""},{"$f":"IF(BQ8=\"\",\"\",BQ8)","v":""},{"$f":"IF(BR8=\"\",\"\",BR8)","v":""},null,{"$f":"IF($CA8=\"\",\"\",IF($F8<>CS$2,\"\",IF($CA8<CS$4+0.00001,1.5,IF($CA8>CS$5+0.00001,0.5,1))))","v":1},"","","","","","","","","",{"$f":"IF(COUNT(CS8:DB8)=0,\"\",SUM(CS8:DB8))","v":1},{"$f":"IF($E8=\"G\",\"\",IF($F8=\"\",\"\",IF($F8=1,$CA8,\"\")))","v":""},{"$f":"IF(DD8=\"\",\"\",RANK(DD8,DD$7:DD$44,1))","v":""},{"$f":"IF($E8=\"G\",\"\",IF($F8=\"\",\"\",IF($F8=2,$CA8+DE$45,\"\")))","v":""},{"$f":"IF($E8=\"G\",\"\",IF($F8=\"\",\"\",IF($F8=3,$CA8+SUM(DE$45:DF$45),\"\")))","v":""},{"$f":"IF($E8=\"G\",\"\",IF($F8=\"\",\"\",IF($F8=4,$CA8+SUM(DE$45:DG$45),\"\")))","v":""},{"$f":"IF($E8=\"G\",\"\",IF($F8=\"\",\"\",IF($F8=5,$CA8+SUM(DE$45:DH$45),\"\")))","v":""},{"$f":"IF($E8=\"G\",\"\",IF($F8=\"\",\"\",IF($F8=6,$CA8+SUM(DE$45:DI$45),\"\")))","v":""},{"$f":"IF($E8=\"G\",\"\",IF($F8=\"\",\"\",IF($F8=7,$CA8+SUM(DE$45:DJ$45),\"\")))","v":""},{"$f":"IF($E8=\"G\",\"\",IF($F8=\"\",\"\",IF($F8=8,$CA8+SUM(DE$45:DK$45),\"\")))","v":""},{"$f":"IF($E8=\"G\",\"\",IF($F8=\"\",\"\",IF($F8=9,$CA8+SUM(DE$45:DL$45),\"\")))","v":""},{"$f":"IF($E8=\"G\",\"\",IF($F8=\"\",\"\",IF($F8=10,$CA8+SUM(DE$45:DM$45),\"\")))","v":""},{"$f":"IF(COUNT(DE8:DN8)=0,\"\",SUM(DE8:DN8))","v":""},{"$f":"IF($E8=\"F\",\"\",IF($F8=\"\",\"\",IF($F8=1,$CA8,\"\")))","v":2},{"$f":"IF(DP8=\"\",\"\",RANK(DP8,DP$7:DP$44,1))","v":2},{"$f":"IF($E8=\"F\",\"\",IF($F8=\"\",\"\",IF($F8=2,$CA8+DQ$45,\"\")))","v":""},{"$f":"IF($E8=\"F\",\"\",IF($F8=\"\",\"\",IF($F8=3,$CA8+SUM(DQ$45:DR$45),\"\")))","v":""},{"$f":"IF($E8=\"F\",\"\",IF($F8=\"\",\"\",IF($F8=4,$CA8+SUM(DQ$45:DS$45),\"\")))","v":""},{"$f":"IF($E8=\"F\",\"\",IF($F8=\"\",\"\",IF($F8=5,$CA8+SUM(DQ$45:DT$45),\"\")))","v":""},{"$f":"IF($E8=\"F\",\"\",IF($F8=\"\",\"\",IF($F8=6,$CA8+SUM(DQ$45:DU$45),\"\")))","v":""},{"$f":"IF($E8=\"F\",\"\",IF($F8=\"\",\"\",IF($F8=7,$CA8+SUM(DQ$45:DV$45),\"\")))","v":""},{"$f":"IF($E8=\"F\",\"\",IF($F8=\"\",\"\",IF($F8=8,$CA8+SUM(DQ$45:DW$45),\"\")))","v":""},{"$f":"IF($E8=\"F\",\"\",IF($F8=\"\",\"\",IF($F8=9,$CA8+SUM(DQ$45:DX$45),\"\")))","v":""},{"$f":"IF($E8=\"F\",\"\",IF($F8=\"\",\"\",IF($F8=10,$CA8+SUM(DQ$45:DY$45),\"\")))","v":""},{"$f":"IF(COUNT(DQ8:DZ8)=0,\"\",SUM(DQ8:DZ8))","v":2},{"$f":"IF(COUNT(CC8,CE8)=0,\"\",SUM(CC8,CE8))","v":2}]
[3,null,{"$f":"'ordre des matchs'!AN10","v":0},{"$f":"'ordre des matchs'!AO10","v":0},{"$f":"'ordre des matchs'!AP10","v":"G"},{"$f":"'ordre des matchs'!AQ10","v":1},{"$f":"'ordre des matchs'!E12","v":5},{"$f":"'ordre des matchs'!G12","v":6},{"$f":"'ordre des matchs'!E13","v":6},{"$f":"'ordre des matchs'!G13","v":5},-1,1,2,"P","G","G","cas4",{"$f":"'ordre des matchs'!O9","v":2},{"$f":"'ordre des matchs'!M9","v":7},{"$f":"'ordre des matchs'!O10","v":4},{"$f":"'ordre des matchs'!M10","v":8},-5,-4,1,"P","P","G","cas1",{"$f":"'ordre des matchs'!U9","v":3},{"$f":"'ordre des matchs'!W9","v":10},{"$f":"'ordre des matchs'!U10","v":5},{"$f":"'ordre des matchs'!W10","v":9},-7,-4,3,"P","P","G","cas2",null,null,null,null,"","","","","","","",null,null,null,null,"","","","","","","",null,null,null,null,"","","","","","","",1,1000,25,3,341.66666666666669,1,4,"","",341.66666666666669,4,"P","G","P","P","P","P","","","","","","",null,0.5,"","","","","","","","","",0.5,"","","","","","","","","","","","",4,4,"","","","","","","","","",4,4]
[4,null,{"$f":"'ordre des matchs'!AN11","v":0},{"$f":"'ordre des matchs'!AO11","v":0},{"$f":"'ordre des matchs'!AP11","v":"G"},{"$f":"'ordre des matchs'!AQ11","v":1},{"$f":"'ordre des matchs'!G12","v":6},{"$f":"'ordre des matchs'!E12","v":5},{"$f":"'ordre des matchs'!G13","v":5},{"$f":"'ordre des matchs'!E13","v":6},1,-1,-2,"G","P","P","cas3",{"$f":"'ordre des matchs'!M12","v":3},{"$f":"'ordre des matchs'!O12","v":15},{"$f":"'ordre des matchs'!M13","v":5},{"$f":"'ordre des matchs'!O13","v":6},-12,-1,11,"P","P","G","cas2",{"$f":"'ordre des matchs'!U12","v":6},{"$f":"'ordre des matchs'!W12","v":5},{"$f":"'ordre des matchs'!U13","v":6},{"$f":"'ordre des matchs'!W13","v":5},1,1,0,"G","G","P","cas5",null,null,null,null,"","","","","","","",null,null,null,null,"","","","","","","",null,null,null,null,"","","","","","","",3,3000,31,3,1010.3333333333334,1,3,"","",1010.3333333333334,3,"G","P","P","P","G","G","","","","","","",null,0.5,"","","","","","","","","",0.5,"","","","","","","","","","","","",3,3,"","","","","","","","","",3,3]
[5,null,{"$f":"'ordre des matchs'!AN12","v":0},{"$f":"'ordre des matchs'!AO12","v":0},{"$f":"'ordre des matchs'!AP12","v":"G"},{"$f":"'ordre des matchs'!AQ12","v":2},{"$f":"'ordre des matchs'!I15","v":7},{"$f":"'ordre des matchs'!K15","v":4},{"$f":"'ordre des matchs'!I16","v":5},{"$f":"'ordre des matchs'!K16","v":6},3,-1,-4,"G","P","P","cas3",{"$f":"'ordre des matchs'!S18","v":9},{"$f":"'ordre des matchs'!Q18","v":3},{"$f":"'ordre des matchs'!S19","v":10},{"$f":"'ordre des matchs'!Q19","v":5},6,5,-1,"G","G","P","cas5",{"$f":"'ordre des matchs'!AA15","v":11},{"$f":"'ordre des matchs'!Y15","v":5},{"$f":"'ordre des matchs'!AA16","v":7},{"$f":"'ordre des matchs'!Y16","v":1},6,6,0,"G","G","P","cas5",null,null,null,null,"","","","","","","",null,null,null,null,"","","","","","","",null,null,null,null,"","","","","","","",5,5000,49,3,1683,2,1,"","",1683,5,"G","P","G","G","G","G","","","","","","",null,"",1.5,"","","","","","","","",1.5,"","","","","","","","","","","","","","",5,"","","","","","","","",5,5]
[6,null,{"$f":"'ordre des matchs'!AN13","v":0},{"$f":"'ordre des matchs'!AO13","v":0},{"$f":"'ordre des matchs'!AP13","v":"F"},{"$f":"'ordre des matchs'!AQ13","v":2},{"$f":"'ordre des matchs'!K15","v":4},{"$f":"'ordre des matchs'!I15","v":7},{"$f":"'ordre des matchs'!K16","v":6},{"$f":"'ordre des matchs'!I16","v":5},-3,1,4,"P","G","G","cas4",{"$f":"'ordre des matchs'!Q15","v":8},{"$f":"'ordre des matchs'!S15","v":11},{"$f":"'ordre des matchs'!Q16","v":7},{"$f":"'ordre des matchs'!S16","v":8},-3,-1,2,"P","P","G","cas2",{"$f":"'ordre des matchs'!AA18","v":6},{"$f":"'ordre des matchs'!Y18","v":5},{"$f":"'ordre des matchs'!AA19","v":3},{"$f":"'ordre des matchs'!Y19","v":3},1,0,-1,"G","","P","",null,null,null,null,"","","","","","","",null,null,null,null,"","","","","","","",null,null,null,null,"","","","","","","",2,2000,34,3,678,2,3,678,2,"","","P","G","P","P","G","","","","","","","",null,"",0.5,"","","","","","","","",0.5,"","",3,"","","","","","","","",3,"","","","","","","","","","","","",2]
[7,null,{"$f":"'ordre des matchs'!AN14","v":0},{"$f":"'ordre des matchs'!AO14","v":0},{"$f":"'ordre des matchs'!AP14","v":"F"},{"$f":"'ordre des matchs'!AQ14","v":2},{"$f":"'ordre des matchs'!I18","v":7},{"$f":"'ordre des matchs'!K18","v":5},{"$f":"'ordre des matchs'!I19","v":8},{"$f":"'ordre des matchs'!K19","v":5},2,3,1,"G","G","G","cas6",{"$f":"'ordre des matchs'!S15","v":11},{"$f":"'ordre des matchs'!Q15","v":8},{"$f":"'ordre des matchs'!S16","v":8},{"$f":"'ordre des matchs'!Q16","v":7},3,1,-2,"G","G","P","cas5",{"$f":"'ordre des matchs'!Y15","v":5},{"$f":"'ordre des matchs'!AA15","v":11},{"$f":"'ordre des matchs'!Y16","v":1},{"$f":"'ordre des matchs'!AA16","v":7},-6,-6,0,"P","P","P","cas1",null,null,null,null,"","","","","","","",null,null,null,null,"","","","","","","",null,null,null,null,"","","","","","","",4,4000,40,3,1346.6666666666667,2,2,1346.6666666666667,1,"","","G","G","G","G","P","P","","","","","","",null,"",1,"","","","","","","","",1,"","",2,"","","","","","","","",2,"","","","","","","","","","","","",1]
[8,null,{"$f":"'ordre des matchs'!AN15","v":0},{"$f":"'ordre des matchs'!AO15","v":0},{"$f":"'ordre des matchs'!AP15","v":"G"},{"$f":"'ordre des matchs'!AQ15","v":2},{"$f":"'ordre des matchs'!K18","v":5},{"$f":"'ordre des matchs'!I18","v":7},{"$f":"'ordre des matchs'!K19","v":5},{"$f":"'ordre des matchs'!I19","v":8},-2,-3,-1,"P","P","P","cas1",{"$f":"'ordre des matchs'!Q18","v":3},{"$f":"'ordre des matchs'!S18","v":9},{"$f":"'ordre des matchs'!Q19","v":5},{"$f":"'ordre des matchs'!S19","v":10},-6,-5,1,"P","P","G","cas1",{"$f":"'ordre des matchs'!Y18","v":5},{"$f":"'ordre des matchs'!AA18","v":6},{"$f":"'ordre des matchs'!Y19","v":3},{"$f":"'ordre des matchs'!AA19","v":3},-1,0,1,"P","","G","",null,null,null,null,"","","","","","","",null,null,null,null,"","","","","","","",null,null,null,null,"","","","","","","","","",26,3,8.6666666666666661,2,4,"","",8.6666666666666661,7,"P","P","P","P","P","","","","","","","",null,"",0.5,"","","","","","","","",0.5,"","","","","","","","","","","","","","",8,"","","","","","","","",8,7]
[9,null,{"$f":"'ordre des matchs'!AN16","v":0},{"$f":"'ordre des matchs'!AO16","v":0},{"$f":"'ordre des matchs'!AP16","v":"G"},{"$f":"'ordre des matchs'!AQ16","v":3},{"$f":"'ordre des matchs'!G21","v":8},{"$f":"'ordre des matchs'!E21","v":4},{"$f":"'ordre des matchs'!G22","v":12},{"$f":"'ordre des matchs'!E22","v":2},4,10,6,"G","G","G","cas6",{"$f":"'ordre des matchs'!M21","v":6},{"$f":"'ordre des matchs'!O21","v":7},{"$f":"'ordre des matchs'!M22","v":6},{"$f":"'ordre des matchs'!O22","v":8},-1,-2,-1,"P","P","P","cas1",{"$f":"'ordre des matchs'!W21","v":7},{"$f":"'ordre des matchs'!U21","v":5},{"$f":"'ordre des matchs'!W22","v":6},{"$f":"'ordre des matchs'!U22","v":7},2,-1,-3,"G","P","P","cas3",null,null,null,null,"","","","","","","",null,null,null,null,"","","","","","","",null,null,null,null,"","","","","","","",3,3000,45,3,1015,3,2,"","",1015,7,"G","G","P","P","G","P","","","","","","",null,"","",1,"","","","","","","",1,"","","","","","","","","","","","","","","",8,"","","","","","","",8,7]
[10,null,{"$f":"'ordre des matchs'!AN17","v":0},{"$f":"'ordre des matchs'!AO17","v":0},{"$f":"'ordre des matchs'!AP17","v":"G"},{"$f":"'ordre des matchs'!AQ17","v":3},{"$f":"'ordre des matchs'!G24","v":8},{"$f":"'ordre des matchs'!E24","v":3},{"$f":"'ordre des matchs'!G25","v":7},{"$f":"'ordre des matchs'!E25","v":4},5,3,-2,"G","G","P","cas5",{"$f":"'ordre des matchs'!O21","v":7},{"$f":"'ordre des matchs'!M21","v":6},{"$f":"'ordre des matchs'!O22","v":8},{"$f":"'ordre des matchs'!M22","v":6},1,2,1,"G","G","G","cas6",{"$f":"'ordre des matchs'!W24","v":3},{"$f":"'ordre des matchs'!U24","v":2},{"$f":"'ordre des matchs'!W25","v":10},{"$f":"'ordre des matchs'!U25","v":2},1,8,7,"G","G","G","cas6",null,null,null,null,"","","","","","","",null,null,null,null,"","","","","","","",null,null,null,null,"","","","","","","",6,6000,43,3,2014.3333333333333,3,1,"","",2014.3333333333333,6,"G","G","G","G","G","G","","","","","","",null,"","",1.5,"","","","","","","",1.5,"","","","","","","","","","","","","","","",7,"","","","","","","",7,6]
[11,null,{"$f":"'ordre des matchs'!AN18","v":0},{"$f":"'ordre des matchs'!AO18","v":0},{"$f":"'ordre des matchs'!AP18","v":"F"},{"$f":"'ordre des matchs'!AQ18","v":3},{"$f":"'ordre des matchs'!E21","v":4},{"$f":"'ordre des matchs'!G21","v":8},{"$f":"'ordre des matchs'!E22","v":2},{"$f":"'ordre des matchs'!G22","v":12},-4,-10,-6,"P","P","P","cas1",{"$f":"'ordre des matchs'!M24","v":6},{"$f":"'ordre des matchs'!O24","v":7},{"$f":"'ordre des matchs'!M25","v":3},{"$f":"'ordre des matchs'!O25","v":6},-1,-3,-2,"P","P","P","cas1",{"$f":"'ordre des matchs'!U24","v":2},{"$f":"'ordre des matchs'!W24","v":3},{"$f":"'ordre des matchs'!U25","v":2},{"$f":"'ordre des matchs'!W25","v":10},-1,-8,-7,"P","P","P","cas1",null,null,null,null,"","","","","","","",null,null,null,null,"","","","","","","",null,null,null,null,"","","","","","","","","",19,3,6.333333333333333,3,4,6.333333333333333,3,"","","P","P","P","P","P","P","","","","","","",null,"","",0.5,"","","","","","","",0.5,"","","",6,"","","","","","","",6,"","","","","","","","","","","","",3]
[12,null,{"$f":"'ordre des matchs'!AN19","v":0},{"$f":"'ordre des matchs'!AO19","v":0},{"$f":"'ordre des matchs'!AP19","v":"G"},{"$f":"'ordre des matchs'!AQ19","v":3},{"$f":"'ordre des matchs'!E24","v":3},{"$f":"'ordre des matchs'!G24","v":8},{"$f":"'ordre des matchs'!E25","v":4},{"$f":"'ordre des matchs'!G25","v":7},-5,-3,2,"P","P","G","cas2",{"$f":"'ordre des matchs'!O24","v":7},{"$f":"'ordre des matchs'!M24","v":6},{"$f":"'ordre des matchs'!O25","v":6},{"$f":"'ordre des matchs'!M25","v":3},1,3,2,"G","G","G","cas6",{"$f":"'ordre des matchs'!U21","v":5},{"$f":"'ordre des matchs'!W21","v":7},{"$f":"'ordre des matchs'!U22","v":7},{"$f":"'ordre des matchs'!W22","v":6},-2,1,3,"P","G","G","cas4",null,null,null,null,"","","","","","","",null,null,null,null,"","","","","","","",null,null,null,null,"","","","","","","",3,3000,32,3,1010.6666666666666,3,3,"","",1010.6666666666666,9,"P","P","G","G","P","G","","","","","","",null,"","",0.5,"","","","","","","",0.5,"","","","","","","","","","","","","","","",9,"","","","","","","",9,9]
[13,null,{"$f":"'ordre des matchs'!AN20","v":0},{"$f":"'ordre des matchs'!AO20","v":0},{"$f":"'ordre des matchs'!AP20","v":"G"},{"$f":"'ordre des matchs'!AQ20","v":4},{"$f":"'ordre des matchs'!K30","v":5},{"$f":"'ordre des matchs'!I30","v":5},{"$f":"'ordre des matchs'!K31","v":12},{"$f":"'ordre des matchs'!I31","v":1},0,11,11,"","G","G","",{"$f":"'ordre des matchs'!Q27","v":8},{"$f":"'ordre des matchs'!S27","v":7},{"$f":"'ordre des matchs'!Q28","v":6},{"$f":"'ordre des matchs'!S28","v":5},1,1,0,"G","G","P","cas5",{"$f":"'ordre des matchs'!Y27","v":9},{"$f":"'ordre des matchs'!AA27","v":2},{"$f":"'ordre des matchs'!Y28","v":6},{"$f":"'ordre des matchs'!AA28","v":2},7,4,-3,"G","G","P","cas5",null,null,null,null,"","","","","","","",null,null,null,null,"","","","","","","",null,null,null,null,"","","","","","","",5,5000,46,3,1682,4,1,"","",1682,10,"","G","G","G","G","G","","","","","","",null,"","","",1.5,"","","","","","",1.5,"","","","","","","","","","","","","","","","",10,"","","","","","",10,10]
[14,null,{"$f":"'ordre des matchs'!AN21","v":0},{"$f":"'ordre des matchs'!AO21","v":0},{"$f":"'ordre des matchs'!AP21","v":"G"},{"$f":"'ordre des matchs'!AQ21","v":4},{"$f":"'ordre des matchs'!I27","v":9},{"$f":"'ordre des matchs'!K27","v":2},{"$f":"'ordre des matchs'!I28","v":10},{"$f":"'ordre des matchs'!K28","v":2},7,8,1,"G","G","G","cas6",{"$f":"'ordre des matchs'!S27","v":7},{"$f":"'ordre des matchs'!Q27","v":8},{"$f":"'ordre des matchs'!S28","v":5},{"$f":"'ordre des matchs'!Q28","v":6},-1,-1,0,"P","P","P","cas1",{"$f":"'ordre des matchs'!Y30","v":10},{"$f":"'ordre des matchs'!AA30","v":2},{"$f":"'ordre des matchs'!Y31","v":6},{"$f":"'ordre des matchs'!AA31","v":2},8,4,-4,"G","G","P","cas5",null,null,null,null,"","","","","","","",null,null,null,null,"","","","","","","",null,null,null,null,"","","","","","","",4,4000,47,3,1349,4,2,"","",1349,11,"G","G","P","P","G","G","","","","","","",null,"","","",1,"","","","","","",1,"","","","","","","","","","","","","","","","",11,"","","","","","",11,11]
[15,null,{"$f":"'ordre des matchs'!AN22","v":0},{"$f":"'ordre des matchs'!AO22","v":0},{"$f":"'ordre des matchs'!AP22","v":"F"},{"$f":"'ordre des matchs'!AQ22","v":4},{"$f":"'ordre des matchs'!K27","v":2},{"$f":"'ordre des matchs'!I27","v":9},{"$f":"'ordre des matchs'!K28","v":2},{"$f":"'ordre des matchs'!I28","v":10},-7,-8,-1,"P","P","P","cas1",{"$f":"'ordre des matchs'!Q30","v":3},{"$f":"'ordre des matchs'!S30","v":7},{"$f":"'ordre des matchs'!Q31","v":5},{"$f":"'ordre des matchs'!S31","v":6},-4,-1,3,"P","P","G","cas2",{"$f":"'ordre des matchs'!AA27","v":2},{"$f":"'ordre des matchs'!Y27","v":9},{"$f":"'ordre des matchs'!AA28","v":2},{"$f":"'ordre des matchs'!Y28","v":6},-7,-4,3,"P","P","G","cas2",null,null,null,null,"","","","","","","",null,null,null,null,"","","","","","","",null,null,null,null,"","","","","","","","","",16,3,5.333333333333333,4,4,5.333333333333333,6,"","","P","P","P","P","P","P","","","","","","",null,"","","",0.5,"","","","","","",0.5,"","","","",7,"","","","","","",7,"","","","","","","","","","","","",6]
[16,null,{"$f":"'ordre des matchs'!AN23","v":0},{"$f":"'ordre des matchs'!AO23","v":0},{"$f":"'ordre des matchs'!AP23","v":"F"},{"$f":"'ordre des matchs'!AQ23","v":4},{"$f":"'ordre des matchs'!I30","v":5},{"$f":"'ordre des matchs'!K30","v":5},{"$f":"'ordre des matchs'!I31","v":1},{"$f":"'ordre des matchs'!K31","v":12},0,-11,-11,"","P","P","",{"$f":"'ordre des matchs'!S30","v":7},{"$f":"'ordre des matchs'!Q30","v":3},{"$f":"'ordre des matchs'!S31","v":6},{"$f":"'ordre des matchs'!Q31","v":5},4,1,-3,"G","G","P","cas5",{"$f":"'ordre des matchs'!AA30","v":2},{"$f":"'ordre des matchs'!Y30","v":10},{"$f":"'ordre des matchs'!AA31","v":2},{"$f":"'ordre des matchs'!Y31","v":6},-8,-4,4,"P","P","G","cas2",null,null,null,null,"","","","","","","",null,null,null,null,"","","","","","","",null,null,null,null,"","","","","","","",2,2000,23,3,674.33333333333337,4,3,674.33333333333337,3,"","","","P","G","G","P","P","","","","","","",null,"","","",0.5,"","","","","","",0.5,"","","","",6,"","","","","","",6,"","","","","","","","","","","","",3]
[17,null,{"$f":"'ordre des matchs'!AN24","v":0},{"$f":"'ordre des matchs'!AO24","v":0},{"$f":"'ordre des matchs'!AP24","v":"F"},{"$f":"'ordre des matchs'!AQ24","v":5},{"$f":"'ordre des matchs'!E33","v":5},{"$f":"'ordre des matchs'!G33","v":6},{"$f":"'ordre des matchs'!E34","v":9},{"$f":"'ordre des matchs'!G34","v":3},-1,6,7,"P","G","G","cas4",{"$f":"'ordre des matchs'!M36","v":13},{"$f":"'ordre des matchs'!O36","v":3},{"$f":"'ordre des matchs'!M37","v":6},{"$f":"'ordre des matchs'!O37","v":5},10,1,-9,"G","G","P","cas5",{"$f":"'ordre des matchs'!U33","v":4},{"$f":"'ordre des matchs'!W33","v":8},{"$f":"'ordre des matchs'!U34","v":4},{"$f":"'ordre des matchs'!W34","v":8},-4,-4,0,"P","P","P","cas1",null,null,null,null,"","","","","","","",null,null,null,null,"","","","","","","",null,null,null,null,"","","","","","","",3,3000,41,3,1013.6666666666666,5,1,1013.6666666666666,3,"","","P","G","G","G","P","P","","","","","","",null,"","","","",1.5,"","","","","",1.5,"","","","","",6,"","","","","",6,"","","","","","","","","","","","",3]
[18,null,{"$f":"'ordre des matchs'!AN25","v":0},{"$f":"'ordre des matchs'!AO25","v":0},{"$f":"'ordre des matchs'!AP25","v":"G"},{"$f":"'ordre des matchs'!AQ25","v":5},{"$f":"'ordre des matchs'!G36","v":9},{"$f":"'ordre des matchs'!E36","v":3},{"$f":"'ordre des matchs'!G37","v":3},{"$f":"'ordre des matchs'!E37","v":11},6,-8,-14,"G","P","P","cas3",{"$f":"'ordre des matchs'!M33","v":7},{"$f":"'ordre des matchs'!O33","v":8},{"$f":"'ordre des matchs'!M34","v":5},{"$f":"'ordre des matchs'!O34","v":6},-1,-1,0,"P","P","P","cas1",{"$f":"'ordre des matchs'!W33","v":8},{"$f":"'ordre des matchs'!U33","v":4},{"$f":"'ordre des matchs'!W34","v":8},{"$f":"'ordre des matchs'!U34","v":4},4,4,0,"G","G","P","cas5",null,null,null,null,"","","","","","","",null,null,null,null,"","","","","","","",null,null,null,null,"","","","","","","",3,3000,40,3,1013.3333333333334,5,2,"","",1013.3333333333334,12,"G","P","P","P","G","G","","","","","","",null,"","","","",1,"","","","","",1,"","","","","","","","","","","","","","","","","",13,"","","","","",13,12]
[19,null,{"$f":"'ordre des matchs'!AN26","v":0},{"$f":"'ordre des matchs'!AO26","v":0},{"$f":"'ordre des matchs'!AP26","v":"F"},{"$f":"'ordre des matchs'!AQ26","v":5},{"$f":"'ordre des matchs'!E36","v":3},{"$f":"'ordre des matchs'!G36","v":9},{"$f":"'ordre des matchs'!E37","v":11},{"$f":"'ordre des matchs'!G37","v":3},-6,8,14,"P","G","G","cas4",{"$f":"'ordre des matchs'!O36","v":3},{"$f":"'ordre des matchs'!M36","v":13},{"$f":"'ordre des matchs'!O37","v":5},{"$f":"'ordre des matchs'!M37","v":6},-10,-1,9,"P","P","G","cas2",{"$f":"'ordre des matchs'!U36","v":7},{"$f":"'ordre des matchs'!W36","v":4},{"$f":"'ordre des matchs'!U37","v":7},{"$f":"'ordre des matchs'!W37","v":5},3,2,-1,"G","G","P","cas5",null,null,null,null,"","","","","","","",null,null,null,null,"","","","","","","",null,null,null,null,"","","","","","","",3,3000,36,3,1012,5,3,1012,7,"","","P","G","P","P","G","G","","","","","","",null,"","","","",0.5,"","","","","",0.5,"","","","","",8,"","","","","",8,"","","","","","","","","","","","",7]
[20,null,{"$f":"'ordre des matchs'!AN27","v":0},{"$f":"'ordre des matchs'!AO27","v":0},{"$f":"'ordre des matchs'!AP27","v":"F"},{"$f":"'ordre des matchs'!AQ27","v":5},{"$f":"'ordre des matchs'!G33","v":6},{"$f":"'ordre des matchs'!E33","v":5},{"$f":"'ordre des matchs'!G34","v":3},{"$f":"'ordre des matchs'!E34","v":9},1,-6,-7,"G","P","P","cas3",{"$f":"'ordre des matchs'!O33","v":8},{"$f":"'ordre des matchs'!M33","v":7},{"$f":"'ordre des matchs'!O34","v":6},{"$f":"'ordre des matchs'!M34","v":5},1,1,0,"G","G","P","cas5",{"$f":"'ordre des matchs'!W36","v":4},{"$f":"'ordre des matchs'!U36","v":7},{"$f":"'ordre des matchs'!W37","v":5},{"$f":"'ordre des matchs'!U37","v":7},-3,-2,1,"P","P","G","cas1",null,null,null,null,"","","","","","","",null,null,null,null,"","","","","","","",null,null,null,null,"","","","","","","",3,3000,32,3,1010.6666666666666,5,4,1010.6666666666666,8,"","","G","P","G","G","P","P","","","","","","",null,"","","","",0.5,"","","","","",0.5,"","","","","",9,"","","","","",9,"","","","","","","","","","","","",8]
[21,null,{"$f":"'ordre des matchs'!AN28","v":0},{"$f":"'ordre des matchs'!AO28","v":0},{"$f":"'ordre des matchs'!AP28","v":"F"},{"$f":"'ordre des matchs'!AQ28","v":6},{"$f":"'ordre des matchs'!K42","v":1},{"$f":"'ordre des matchs'!I42","v":7},{"$f":"'ordre des matchs'!K43","v":5},{"$f":"'ordre des matchs'!I43","v":7},-6,-2,4,"P","P","G","cas2",{"$f":"'ordre des matchs'!S42","v":5},{"$f":"'ordre des matchs'!Q42","v":9},{"$f":"'ordre des matchs'!S43","v":3},{"$f":"'ordre des matchs'!Q43","v":7},-4,-4,0,"P","P","P","cas1",{"$f":"'ordre des matchs'!Y39","v":0},{"$f":"'ordre des matchs'!AA39","v":0},{"$f":"'ordre des matchs'!Y40","v":0},{"$f":"'ordre des matchs'!AA40","v":0},0,0,0,"","","P","",null,null,null,null,"","","","","","","",null,null,null,null,"","","","","","","",null,null,null,null,"","","","","","","","","",14,3,4.666666666666667,6,4,4.666666666666667,11,"","","P","P","P","P","","","","","","","","",null,"","","","","",0.5,"","","","",0.5,"","","","","","",12,"","","","",12,"","","","","","","","","","","","",11]
[22,null,{"$f":"'ordre des matchs'!AN29","v":0},{"$f":"'ordre des matchs'!AO29","v":0},{"$f":"'ordre des matchs'!AP29","v":"F"},{"$f":"'ordre des matchs'!AQ29","v":6},{"$f":"'ordre des matchs'!I39","v":6},{"$f":"'ordre des matchs'!K39","v":5},{"$f":"'ordre des matchs'!I40","v":3},{"$f":"'ordre des matchs'!K40","v":9},1,-6,-7,"G","P","P","cas3",{"$f":"'ordre des matchs'!Q39","v":6},{"$f":"'ordre des matchs'!S39","v":5},{"$f":"'ordre des matchs'!Q40","v":3},{"$f":"'ordre des matchs'!S40","v":8},1,-5,-6,"G","P","P","cas3",{"$f":"'ordre des matchs'!AA39","v":0},{"$f":"'ordre des matchs'!Y39","v":0},{"$f":"'ordre des matchs'!AA40","v":0},{"$f":"'ordre des matchs'!Y40","v":0},0,0,0,"","","P","",null,null,null,null,"","","","","","","",null,null,null,null,"","","","","","","",null,null,null,null,"","","","","","","",2,2000,18,3,672.66666666666663,6,3,672.66666666666663,9,"","","G","P","G","P","","","","","","","","",null,"","","","","",0.5,"","","","",0.5,"","","","","","",11,"","","","",11,"","","","","","","","","","","","",9]
[23,null,{"$f":"'ordre des matchs'!AN30","v":0},{"$f":"'ordre des matchs'!AO30","v":0},{"$f":"'ordre des matchs'!AP30","v":"G"},{"$f":"'ordre des matchs'!AQ30","v":6},{"$f":"'ordre des matchs'!K39","v":5},{"$f":"'ordre des matchs'!I39","v":6},{"$f":"'ordre des matchs'!K40","v":9},{"$f":"'ordre des matchs'!I40","v":3},-1,6,7,"P","G","G","cas4",{"$f":"'ordre des matchs'!Q42","v":9},{"$f":"'ordre des matchs'!S42","v":5},{"$f":"'ordre des matchs'!Q43","v":7},{"$f":"'ordre des matchs'!S43","v":3},4,4,0,"G","G","P","cas5",{"$f":"'ordre des matchs'!Y42","v":0},{"$f":"'ordre des matchs'!AA42","v":0},{"$f":"'ordre des matchs'!Y43","v":0},{"$f":"'ordre des matchs'!AA43","v":0},0,0,0,"","","P","",null,null,null,null,"","","","","","","",null,null,null,null,"","","","","","","",null,null,null,null,"","","","","","","",3,3000,30,3,1010,6,1,"","",1010,12,"P","G","G","G","","","","","","","","",null,"","","","","",1.5,"","","","",1.5,"","","","","","","","","","","","","","","","","","",13,"","","","",13,12]
[24,null,{"$f":"'ordre des matchs'!AN31","v":0},{"$f":"'ordre des matchs'!AO31","v":0},{"$f":"'ordre des matchs'!AP31","v":"G"},{"$f":"'ordre des matchs'!AQ31","v":6},{"$f":"'ordre des matchs'!I42","v":7},{"$f":"'ordre des matchs'!K42","v":1},{"$f":"'ordre des matchs'!I43","v":7},{"$f":"'ordre des matchs'!K43","v":5},6,2,-4,"G","G","P","cas5",{"$f":"'ordre des matchs'!S39","v":5},{"$f":"'ordre des matchs'!Q39","v":6},{"$f":"'ordre des matchs'!S40","v":8},{"$f":"'ordre des matchs'!Q40","v":3},-1,5,6,"P","G","G","cas4",{"$f":"'ordre des matchs'!AA42","v":0},{"$f":"'ordre des matchs'!Y42","v":0},{"$f":"'ordre des matchs'!AA43","v":0},{"$f":"'ordre des matchs'!Y43","v":0},0,0,0,"","","P","",null,null,null,null,"","","","","","","",null,null,null,null,"","","","","","","",null,null,null,null,"","","","","","","",3,3000,27,3,1009,6,2,"","",1009,14,"G","G","P","G","","","","","","","","",null,"","","","","",1,"","","","",1,"","","","","","","","","","","","","","","","","","",14,"","","","",14,14]
[25,null,{"$f":"'ordre des matchs'!AN32","v":0},{"$f":"'ordre des matchs'!AO32","v":0},{"$f":"'ordre des matchs'!AP32","v":"F"},{"$f":"'ordre des matchs'!AQ32","v":7},{"$f":"'ordre des matchs'!E49","v":7},{"$f":"'ordre des matchs'!G49","v":6},{"$f":"'ordre des matchs'!E50","v":6},{"$f":"'ordre des matchs'!G50","v":4},1,2,1,"G","G","G","cas6",{"$f":"'ordre des matchs'!S49","v":7},{"$f":"'ordre des matchs'!Q49","v":2},{"$f":"'ordre des matchs'!S50","v":8},{"$f":"'ordre des matchs'!Q50","v":3},5,5,0,"G","G","P","cas5",{"$f":"'ordre des matchs'!AC46","v":7},{"$f":"'ordre des matchs'!AE46","v":1},{"$f":"'ordre des matchs'!AC47","v":5},{"$f":"'ordre des matchs'!AE47","v":3},6,2,-4,"G","G","P","cas5",null,null,null,null,"","","","","","","",null,null,null,null,"","","","","","","",null,null,null,null,"","","","","","","",6,6000,40,3,2013.3333333333333,7,1,2013.3333333333333,9,"","","G","G","G","G","G","G","","","","","","",null,"","","","","","",1.5,"","","",1.5,"","","","","","","",11,"","","",11,"","","","","","","","","","","","",9]
[26,null,{"$f":"'ordre des matchs'!AN33","v":0},{"$f":"'ordre des matchs'!AO33","v":0},{"$f":"'ordre des matchs'!AP33","v":"F"},{"$f":"'ordre des matchs'!AQ33","v":7},{"$f":"'ordre des matchs'!E46","v":3},{"$f":"'ordre des matchs'!G46","v":7},{"$f":"'ordre des matchs'!E47","v":8},{"$f":"'ordre des matchs'!G47","v":2},-4,6,10,"P","G","G","cas4",{"$f":"'ordre des matchs'!Q46","v":3},{"$f":"'ordre des matchs'!S46","v":7},{"$f":"'ordre des matchs'!Q47","v":4},{"$f":"'ordre des matchs'!S47","v":6},-4,-2,2,"P","P","G","cas2",{"$f":"'ordre des matchs'!AE46","v":1},{"$f":"'ordre des matchs'!AC46","v":7},{"$f":"'ordre des matchs'!AE47","v":3},{"$f":"'ordre des matchs'!AC47","v":5},-6,-2,4,"P","P","G","cas2",null,null,null,null,"","","","","","","",null,null,null,null,"","","","","","","",null,null,null,null,"","","","","","","",1,1000,22,3,340.66666666666669,7,4,340.66666666666669,14,"","","P","G","P","P","P","P","","","","","","",null,"","","","","","",0.5,"","","",0.5,"","","","","","","",14,"","","",14,"","","","","","","","","","","","",14]
[27,null,{"$f":"'ordre des matchs'!AN34","v":0},{"$f":"'ordre des matchs'!AO34","v":0},{"$f":"'ordre des matchs'!AP34","v":"F"},{"$f":"'ordre des matchs'!AQ34","v":7},{"$f":"'ordre des matchs'!G46","v":7},{"$f":"'ordre des matchs'!E46","v":3},{"$f":"'ordre des matchs'!G47","v":2},{"$f":"'ordre des matchs'!E47","v":8},4,-6,-10,"G","P","P","cas3",{"$f":"'ordre des matchs'!Q49","v":2},{"$f":"'ordre des matchs'!S49","v":7},{"$f":"'ordre des matchs'!Q50","v":3},{"$f":"'ordre des matchs'!S50","v":8},-5,-5,0,"P","P","P","cas1",{"$f":"'ordre des matchs'!AC49","v":3},{"$f":"'ordre des matchs'!AE49","v":5},{"$f":"'ordre des matchs'!AC50","v":6},{"$f":"'ordre des matchs'!AE50","v":3},-2,3,5,"P","G","G","cas4",null,null,null,null,"","","","","","","",null,null,null,null,"","","","","","","",null,null,null,null,"","","","","","","",2,2000,23,3,674.33333333333337,7,3,674.33333333333337,13,"","","G","P","P","P","P","G","","","","","","",null,"","","","","","",0.5,"","","",0.5,"","","","","","","",13,"","","",13,"","","","","","","","","","","","",13]
[28,null,{"$f":"'ordre des matchs'!AN35","v":0},{"$f":"'ordre des matchs'!AO35","v":0},{"$f":"'ordre des matchs'!AP35","v":"F"},{"$f":"'ordre des matchs'!AQ35","v":7},{"$f":"'ordre des matchs'!G49","v":6},{"$f":"'ordre des matchs'!E49","v":7},{"$f":"'ordre des matchs'!G50","v":4},{"$f":"'ordre des matchs'!E50","v":6},-1,-2,-1,"P","P","P","cas1",{"$f":"'ordre des matchs'!S46","v":7},{"$f":"'ordre des matchs'!Q46","v":3},{"$f":"'ordre des matchs'!S47","v":6},{"$f":"'ordre des matchs'!Q47","v":4},4,2,-2,"G","G","P","cas5",{"$f":"'ordre des matchs'!AE49","v":5},{"$f":"'ordre des matchs'!AC49","v":3},{"$f":"'ordre des matchs'!AE50","v":3},{"$f":"'ordre des matchs'!AC50","v":6},2,-3,-5,"G","P","P","cas3",null,null,null,null,"","","","","","","",null,null,null,null,"","","","","","","",null,null,null,null,"","","","","","","",3,3000,31,3,1010.3333333333334,7,2,1010.3333333333334,11,"","","P","P","G","G","G","P","","","","","","",null,"","","","","","",1,"","","",1,"","","","","","","",12,"","","",12,"","","","","","","","","","","","",11]
[29,null,{"$f":"'ordre des matchs'!AN36","v":0},{"$f":"'ordre des matchs'!AO36","v":0},{"$f":"'ordre des matchs'!AP36","v":0},{"$f":"'ordre des matchs'!AQ36","v":8},{"$f":"'ordre des matchs'!M55","v":0},{"$f":"'ordre des matchs'!O55","v":0},{"$f":"'ordre des matchs'!M56","v":0},{"$f":"'ordre des matchs'!O56","v":0},0,0,0,"","","P","",{"$f":"'ordre des matchs'!U55","v":0},{"$f":"'ordre des matchs'!W55","v":0},{"$f":"'ordre des matchs'!U56","v":0},{"$f":"'ordre des matchs'!W56","v":0},0,0,0,"","","P","",{"$f":"'ordre des matchs'!AG52","v":0},{"$f":"'ordre des matchs'!AI52","v":0},{"$f":"'ordre des matchs'!AG53","v":0},{"$f":"'ordre des matchs'!AI53","v":0},0,0,0,"","","P","",null,null,null,null,"","","","","","","",null,null,null,null,"","","","","","","",null,null,null,null,"","","","","","","","","",0,3,0,8,1,"",15,"",15,"","","","","","","","","","","","",null,"","","","","","","",1.5,"","",1.5,"","","","","","","","",15,"","",15,"","","","","","","","",15,"","",15,30]
[30,null,{"$f":"'ordre des matchs'!AN37","v":0},{"$f":"'ordre des matchs'!AO37","v":0},{"$f":"'ordre des matchs'!AP37","v":0},{"$f":"'ordre des matchs'!AQ37","v":8},{"$f":"'ordre des matchs'!M52","v":0},{"$f":"'ordre des matchs'!O52","v":0},{"$f":"'ordre des matchs'!M53","v":0},{"$f":"'ordre des matchs'!O53","v":0},{"$f":"IF(COUNT(G36:H36)<2,\"\",G36-H36)","v":0},{"$f":"IF(COUNT(I36:J36)<2,\"\",I36-J36)","v":0},{"$f":"IF(COUNT(I36:J36)<2,\"\",L36-K36)","v":0},"","",{"$f":"IF(M36=\"\",\"\",IF(M36=0,\"P\",IF(M36>0,\"G\",\"P\")))","v":"P"},"",{"$f":"'ordre des matchs'!U52","v":0},{"$f":"'ordre des matchs'!W52","v":0},{"$f":"'ordre des matchs'!U53","v":0},{"$f":"'ordre des matchs'!W53","v":0},{"$f":"IF(COUNT(R36:S36)<2,\"\",R36-S36)","v":0},{"$f":"IF(COUNT(T36:U36)<2,\"\",T36-U36)","v":0},{"$f":"IF(COUNT(T36:U36)<2,\"\",W36-V36)","v":0},"","",{"$f":"IF(X36=\"\",\"\",IF(X36=0,\"P\",IF(X36>0,\"G\",\"P\")))","v":"P"},"",{"$f":"'ordre des matchs'!AI52","v":0},{"$f":"'ordre des matchs'!AG52","v":0},{"$f":"'ordre des matchs'!AI53","v":0},{"$f":"'ordre des matchs'!AG53","v":0},{"$f":"IF(COUNT(AC36:AD36)<2,\"\",AC36-AD36)","v":0},{"$f":"IF(COUNT(AE36:AF36)<2,\"\",AE36-AF36)","v":0},{"$f":"IF(COUNT(AE36:AF36)<2,\"\",AH36-AG36)","v":0},{"$f":"IF(AG36=\"\",\"\",IF(AG36=0,\"\",IF(AG36>0,\"G\",\"P\")))","v":""},"",{"$f":"IF(AI36=\"\",\"\",IF(AI36=0,\"P\",IF(AI36>0,\"G\",\"P\")))","v":"P"},"",null,null,null,null,{"$f":"IF(COUNT(AN36:AO36)<2,\"\",AN36-AO36)","v":""},{"$f":"IF(COUNT(AP36:AQ36)<2,\"\",AP36-AQ36)","v":""},{"$f":"IF(COUNT(AP36:AQ36)<2,\"\",AS36-AR36)","v":""},{"$f":"IF(AR36=\"\",\"\",IF(AR36=0,\"\",IF(AR36>0,\"G\",\"P\")))","v":""},"",{"$f":"IF(AT36=\"\",\"\",IF(AT36=0,\"P\",IF(AT36>0,\"G\",\"P\")))","v":""},"",null,null,null,null,{"$f":"IF(COUNT(AY36:AZ36)<2,\"\",AY36-AZ36)","v":""},{"$f":"IF(COUNT(BA36:BB36)<2,\"\",BA36-BB36)","v":""},{"$f":"IF(COUNT(BA36:BB36)<2,\"\",BD36-BC36)","v":""},{"$f":"IF(BC36=\"\",\"\",IF(BC36=0,\"\",IF(BC36>0,\"G\",\"P\")))","v":""},"",{"$f":"IF(BE36=\"\",\"\",IF(BE36=0,\"P\",IF(BE36>0,\"G\",\"P\")))","v":""},"",null,null,null,null,{"$f":"IF(COUNT(BJ36:BK36)<2,\"\",BJ36-BK36)","v":""},{"$f":"IF(COUNT(BL36:BM36)<2,\"\",BL36-BM36)","v":""},{"$f":"IF(COUNT(BL36:BM36)<2,\"\",BO36-BN36)","v":""},{"$f":"IF(BN36=\"\",\"\",IF(BN36=0,\"\",IF(BN36>0,\"G\",\"P\")))","v":""},"",{"$f":"IF(BP36=\"\",\"\",IF(BP36=0,\"P\",IF(BP36>0,\"G\",\"P\")))","v":""},"",{"$f":"IF(COUNTIF(CF36:CQ36,\"G\")=0,\"\",COUNTIF(CF36:CQ36,\"G\"))","v":""},{"$f":"IF(BU36=\"\",\"\",BU36*1000)","v":""},{"$f":"IF(COUNT(G36,I36,R36,T36,AC36,AE36,AN36,AP36,AY36,BA36,BJ36,BL36)=0,\"\",SUM(G36,I36,R36,T36,AC36,AE36,AN36,AP36,AY36,BA36,BJ36,BL36))","v":0},3,0,{"$f":"IF(F36=\"\",\"\",F36)","v":8},1,"",15,"",15,{"$f":"IF(N36=\"\",\"\",N36)","v":""},"",{"$f":"IF(Y36=\"\",\"\",Y36)","v":""},"",{"$f":"IF(AJ36=\"\",\"\",AJ36)","v":""},"",{"$f":"IF(AU36=\"\",\"\",AU36)","v":""},"",{"$f":"IF(BF36=\"\",\"\",BF36)","v":""},"",{"$f":"IF(BQ36=\"\",\"\",BQ36)","v":""},"",null,"","","","","","","",1.5,"","",{"$f":"IF(COUNT(CS36:DB36)=0,\"\",SUM(CS36:DB36))","v":1.5},"","","","","","","","",15,"","",15,"","","","","","","","",15,"","",15,30]
[31,null,{"$f":"'ordre des matchs'!AN38","v":0},{"$f":"'ordre des matchs'!AO38","v":0},{"$f":"'ordre des matchs'!AP38","v":0},{"$f":"'ordre des matchs'!AQ38","v":8},{"$f":"'ordre des matchs'!O52","v":0},{"$f":"'ordre des matchs'!M52","v":0},{"$f":"'ordre des matchs'!O53","v":0},{"$f":"'ordre des matchs'!M53","v":0},0,0,0,{"$f":"IF(K37=\"\",\"\",IF(K37=0,\"\",IF(K37>0,\"G\",\"P\")))","v":""},"","P",{"$f":"IF(COUNT(G37:J37)<4,\"\",IF(AND(N37=\"G\",O37=\"G\",P37=\"G\"),\"cas6\",IF(AND(N37=\"G\",O37=\"G\",P37=\"P\"),\"cas5\",IF(AND(N37=\"P\",O37=\"G\",P37=\"G\"),\"cas4\",IF(AND(N37=\"G\",O37=\"P\",P37=\"P\"),\"cas3\",IF(AND(N37=\"P\",O37=\"P\",L37>=K37+2),\"cas2\",IF(AND(N37=\"P\",O37=\"P\",L37<=K37+1),\"cas1\",\"\")))))))","v":""},{"$f":"'ordre des matchs'!W55","v":0},{"$f":"'ordre des matchs'!U55","v":0},{"$f":"'ordre des matchs'!W56","v":0},{"$f":"'ordre des matchs'!U56","v":0},0,0,0,{"$f":"IF(V37=\"\",\"\",IF(V37=0,\"\",IF(V37>0,\"G\",\"P\")))","v":""},"","P",{"$f":"IF(COUNT(R37:U37)<4,\"\",IF(AND(Y37=\"G\",Z37=\"G\",AA37=\"G\"),\"cas6\",IF(AND(Y37=\"G\",Z37=\"G\",AA37=\"P\"),\"cas5\",IF(AND(Y37=\"P\",Z37=\"G\",AA37=\"G\"),\"cas4\",IF(AND(Y37=\"G\",Z37=\"P\",AA37=\"P\"),\"cas3\",IF(AND(Y37=\"P\",Z37=\"P\",W37>=V37+2),\"cas2\",IF(AND(Y37=\"P\",Z37=\"P\",W37<=V37+1),\"cas1\",\"\")))))))","v":""},{"$f":"'ordre des matchs'!AG55","v":0},{"$f":"'ordre des matchs'!AI55","v":0},{"$f":"'ordre des matchs'!AG56","v":0},{"$f":"'ordre des matchs'!AI56","v":0},{"$f":"IF(COUNT(AC37:AD37)<2,\"\",AC37-AD37)","v":0},{"$f":"IF(COUNT(AE37:AF37)<2,\"\",AE37-AF37)","v":0},{"$f":"IF(COUNT(AE37:AF37)<2,\"\",AH37-AG37)","v":0},"","",{"$f":"IF(AI37=\"\",\"\",IF(AI37=0,\"P\",IF(AI37>0,\"G\",\"P\")))","v":"P"},"",null,null,null,null,{"$f":"IF(COUNT(AN37:AO37)<2,\"\",AN37-AO37)","v":""},{"$f":"IF(COUNT(AP37:AQ37)<2,\"\",AP37-AQ37)","v":""},{"$f":"IF(COUNT(AP37:AQ37)<2,\"\",AS37-AR37)","v":""},"","",{"$f":"IF(AT37=\"\",\"\",IF(AT37=0,\"P\",IF(AT37>0,\"G\",\"P\")))","v":""},"",null,null,null,null,{"$f":"IF(COUNT(AY37:AZ37)<2,\"\",AY37-AZ37)","v":""},{"$f":"IF(COUNT(BA37:BB37)<2,\"\",BA37-BB37)","v":""},{"$f":"IF(COUNT(BA37:BB37)<2,\"\",BD37-BC37)","v":""},"","",{"$f":"IF(BE37=\"\",\"\",IF(BE37=0,\"P\",IF(BE37>0,\"G\",\"P\")))","v":""},"",null,null,null,null,{"$f":"IF(COUNT(BJ37:BK37)<2,\"\",BJ37-BK37)","v":""},{"$f":"IF(COUNT(BL37:BM37)<2,\"\",BL37-BM37)","v":""},{"$f":"IF(COUNT(BL37:BM37)<2,\"\",BO37-BN37)","v":""},"","",{"$f":"IF(BP37=\"\",\"\",IF(BP37=0,\"P\",IF(BP37>0,\"G\",\"P\")))","v":""},"",{"$f":"IF(COUNTIF(CF37:CQ37,\"G\")=0,\"\",COUNTIF(CF37:CQ37,\"G\"))","v":""},{"$f":"IF(BU37=\"\",\"\",BU37*1000)","v":""},{"$f":"IF(COUNT(G37,I37,R37,T37,AC37,AE37,AN37,AP37,AY37,BA37,BJ37,BL37)=0,\"\",SUM(G37,I37,R37,T37,AC37,AE37,AN37,AP37,AY37,BA37,BJ37,BL37))","v":0},3,0,{"$f":"IF(F37=\"\",\"\",F37)","v":8},1,"",15,"",15,"","","","","","","","","","","","",null,"","","","","","","",1.5,"","",{"$f":"IF(COUNT(CS37:DB37)=0,\"\",SUM(CS37:DB37))","v":1.5},"","","","","","","","",15,"","",15,"","","","","","","","",15,"","",15,30]
[32,null,{"$f":"'ordre des matchs'!AN39","v":0},{"$f":"'ordre des matchs'!AO39","v":0},{"$f":"'ordre des matchs'!AP39","v":0},{"$f":"'ordre des matchs'!AQ39","v":0},{"$f":"'ordre des matchs'!O55","v":0},{"$f":"'ordre des matchs'!M55","v":0},{"$f":"'ordre des matchs'!O56","v":0},{"$f":"'ordre des matchs'!M56","v":0},0,0,0,"","","P","",{"$f":"'ordre des matchs'!W52","v":0},{"$f":"'ordre des matchs'!U52","v":0},{"$f":"'ordre des matchs'!W53","v":0},{"$f":"'ordre des matchs'!U53","v":0},0,0,0,"","","P","",{"$f":"'ordre des matchs'!AI55","v":0},{"$f":"'ordre des matchs'!AG55","v":0},{"$f":"'ordre des matchs'!AI56","v":0},{"$f":"'ordre des matchs'!AG56","v":0},{"$f":"IF(COUNT(AC38:AD38)<2,\"\",AC38-AD38)","v":0},{"$f":"IF(COUNT(AE38:AF38)<2,\"\",AE38-AF38)","v":0},{"$f":"IF(COUNT(AE38:AF38)<2,\"\",AH38-AG38)","v":0},"","",{"$f":"IF(AI38=\"\",\"\",IF(AI38=0,\"P\",IF(AI38>0,\"G\",\"P\")))","v":"P"},"",null,null,null,null,{"$f":"IF(COUNT(AN38:AO38)<2,\"\",AN38-AO38)","v":""},{"$f":"IF(COUNT(AP38:AQ38)<2,\"\",AP38-AQ38)","v":""},{"$f":"IF(COUNT(AP38:AQ38)<2,\"\",AS38-AR38)","v":""},"","",{"$f":"IF(AT38=\"\",\"\",IF(AT38=0,\"P\",IF(AT38>0,\"G\",\"P\")))","v":""},"",null,null,null,null,{"$f":"IF(COUNT(AY38:AZ38)<2,\"\",AY38-AZ38)","v":""},{"$f":"IF(COUNT(BA38:BB38)<2,\"\",BA38-BB38)","v":""},{"$f":"IF(COUNT(BA38:BB38)<2,\"\",BD38-BC38)","v":""},"","",{"$f":"IF(BE38=\"\",\"\",IF(BE38=0,\"P\",IF(BE38>0,\"G\",\"P\")))","v":""},"",null,null,null,null,{"$f":"IF(COUNT(BJ38:BK38)<2,\"\",BJ38-BK38)","v":""},{"$f":"IF(COUNT(BL38:BM38)<2,\"\",BL38-BM38)","v":""},{"$f":"IF(COUNT(BL38:BM38)<2,\"\",BO38-BN38)","v":""},"","",{"$f":"IF(BP38=\"\",\"\",IF(BP38=0,\"P\",IF(BP38>0,\"G\",\"P\")))","v":""},"",{"$f":"IF(COUNTIF(CF38:CQ38,\"G\")=0,\"\",COUNTIF(CF38:CQ38,\"G\"))","v":""},{"$f":"IF(BU38=\"\",\"\",BU38*1000)","v":""},{"$f":"IF(COUNT(G38,I38,R38,T38,AC38,AE38,AN38,AP38,AY38,BA38,BJ38,BL38)=0,\"\",SUM(G38,I38,R38,T38,AC38,AE38,AN38,AP38,AY38,BA38,BJ38,BL38))","v":0},3,0,{"$f":"IF(F38=\"\",\"\",F38)","v":0},1,"","","","","","","","","","","","","","","","",null,"","","","","","","","","","",{"$f":"IF(COUNT(CS38:DB38)=0,\"\",SUM(CS38:DB38))","v":""},"","","","","","","","","","","","","","","","","","","","","","","","",""]
[33,null,null,null,null,null,null,null,null,null,"","","","","","","",null,null,null,null,"","","","","","","",null,null,null,null,{"$f":"IF(COUNT(AC39:AD39)<2,\"\",AC39-AD39)","v":""},{"$f":"IF(COUNT(AE39:AF39)<2,\"\",AE39-AF39)","v":""},{"$f":"IF(COUNT(AE39:AF39)<2,\"\",AH39-AG39)","v":""},"","",{"$f":"IF(AI39=\"\",\"\",IF(AI39=0,\"P\",IF(AI39>0,\"G\",\"P\")))","v":""},"",null,null,null,null,{"$f":"IF(COUNT(AN39:AO39)<2,\"\",AN39-AO39)","v":""},{"$f":"IF(COUNT(AP39:AQ39)<2,\"\",AP39-AQ39)","v":""},{"$f":"IF(COUNT(AP39:AQ39)<2,\"\",AS39-AR39)","v":""},"","",{"$f":"IF(AT39=\"\",\"\",IF(AT39=0,\"P\",IF(AT39>0,\"G\",\"P\")))","v":""},"",null,null,null,null,{"$f":"IF(COUNT(AY39:AZ39)<2,\"\",AY39-AZ39)","v":""},{"$f":"IF(COUNT(BA39:BB39)<2,\"\",BA39-BB39)","v":""},{"$f":"IF(COUNT(BA39:BB39)<2,\"\",BD39-BC39)","v":""},"","",{"$f":"IF(BE39=\"\",\"\",IF(BE39=0,\"P\",IF(BE39>0,\"G\",\"P\")))","v":""},"",null,null,null,null,{"$f":"IF(COUNT(BJ39:BK39)<2,\"\",BJ39-BK39)","v":""},{"$f":"IF(COUNT(BL39:BM39)<2,\"\",BL39-BM39)","v":""},{"$f":"IF(COUNT(BL39:BM39)<2,\"\",BO39-BN39)","v":""},"","",{"$f":"IF(BP39=\"\",\"\",IF(BP39=0,\"P\",IF(BP39>0,\"G\",\"P\")))","v":""},"",{"$f":"IF(COUNTIF(CF39:CQ39,\"G\")=0,\"\",COUNTIF(CF39:CQ39,\"G\"))","v":""},{"$f":"IF(BU39=\"\",\"\",BU39*1000)","v":""},{"$f":"IF(COUNT(G39,I39,R39,T39,AC39,AE39,AN39,AP39,AY39,BA39,BJ39,BL39)=0,\"\",SUM(G39,I39,R39,T39,AC39,AE39,AN39,AP39,AY39,BA39,BJ39,BL39))","v":""},"","",{"$f":"IF(F39=\"\",\"\",F39)","v":""},"","","","","","","","","","","","","","","","","",null,"","","","","","","","","","",{"$f":"IF(COUNT(CS39:DB39)=0,\"\",SUM(CS39:DB39))","v":""},"","","","","","","","","","","","","","","","","","","","","","","","",""]
[34,null,null,null,null,null,null,null,null,null,"","","",{"$f":"IF(K40=\"\",\"\",IF(K40=0,\"\",IF(K40>0,\"G\",\"P\")))","v":""},"","","",null,null,null,null,"","","",{"$f":"IF(V40=\"\",\"\",IF(V40=0,\"\",IF(V40>0,\"G\",\"P\")))","v":""},"","","",null,null,null,null,"","","","","","","",null,null,null,null,"","","","","","","",null,null,null,null,"","","","","","","",null,null,null,null,"","","","","","","","","","","","","","","","","","","","","","","","","","","","","","",null,"","","","","","","","","","","","","","","","","","","","","","","","","","","","","","","","","","","",""]
[35,null,null,null,null,null,null,null,null,null,"","","","","","","",null,null,null,null,"","","","","","","",null,null,null,null,"","","","","","","",null,null,null,null,"","","","","","","",null,null,null,null,"","","","","","","",null,null,null,null,"","","","","","","","","","","","","","","","","","","","","","","","","","","","","","",null,"","","","","","","","","","","","","","","","","","","","","","","","","","","","","","","","","","","",""]
[36,null,null,null,null,null,null,null,null,null,"","","","","","","",null,null,null,null,"","","","","","","",null,null,null,null,"","","","","","","",null,null,null,null,"","","","","","","",null,null,null,null,"","","","","","","",null,null,null,null,"","","","","","","","","","","","","","","","","","","","","","","","","","","","","","",null,"","","","","","","","","","","","","","","","","","","","","","","","","","","","","","","","","","","",""]
[37,null,null,null,null,null,null,null,null,null,"","","","","","","",null,null,null,null,"","","","","","","",null,null,null,null,"","","","","","","",null,null,null,null,"","","","","","","",null,null,null,null,"","","","","","","",null,null,null,null,"","","","","","","","","","","","","","","","","","","","","","","","","","","","","","",null,"","","","","","","","","","","","","","","","","","","","","","","","","","","","","","","","","","","",""]
[38,null,null,null,null,null,null,null,null,null,"","","","","","","",null,null,null,null,"","","","","","","",null,null,null,null,"","","","","","","",null,null,null,null,"","","","","","","",null,null,null,null,"","","","","","","",null,null,null,null,"","","","","","","","","","","","","","","","","","","","","","","","","","","","","","",null,"","","","","","","","","","","","","","","","","","","","","","","","","","","","","","","","","","","",""]
[null,null,null,null,null,null,null,null,null,null,null,null,null,null,null,null,null,null,null,null,null,null,null,null,null,null,null,null,null,null,null,null,null,null,null,null,null,null,null,null,null,null,null,null,null,null,null,null,null,null,null,null,null,null,null,null,null,null,null,null,null,null,null,null,null,null,null,null,null,null,null,null,null,null,null,null,null,null,null,null,null,null,null,null,null,null,null,null,null,null,null,null,null,null,null,null,null,null,null,null,null,null,null,null,null,null,null,null,{"$f":"COUNT(DE7:DE44)","v":0},2,1,2,3,2,4,3,0,0,null,null,{"$f":"COUNT(DQ7:DQ44)","v":4},{"$f":"COUNT(DR7:DR44)","v":2},3,2,1,2,0,3,0,0]
[]
[null,null,null,null,"G",1]
[null,null,null,null,"F",2,null,null,null,null,"cas1"]
[null,null,null,null,null,3,null,null,null,null,"cas2"]
[null,null,null,null,null,4,null,null,null,null,"cas3"]
[null,null,null,null,null,5,null,null,null,null,"cas4"]
[null,null,null,null,null,6,null,null,null,null,"cas5"]
[null,null,null,null,null,7,null,null,null,null,"cas6"]
[null,null,null,null,null,8]
[null,null,null,null,null,9]
[null,null,null,null,null,10]

{"sheet":"fiche calcul","index":3,"n_rows":101,"n_cols":55,"rows_kept":101,"cut":false,"hidden":false,"merged":[[70,4,70,5],[7,14,9,14],[48,16,49,17],[65,54,66,54],[48,54,49,54],[62,4,62,5],[48,40,49,40],[7,40,8,48],[48,37,49,37],[48,20,49,36],[48,52,49,52],[7,52,8,52],[7,49,8,49],[7,15,8,27],[7,8,8,13],[2,1,2,3],[7,1,8,3],[0,4,1,4],[6,15,6,48],[3,1,3,3],[0,39,0,45],[0,1,1,3],[0,15,0,37],[2,5,2,54],[3,5,3,54],[4,1,4,3],[4,5,4,54],[7,28,8,39]]}
[null,"Eléments évalués",null,null,"Niveau",null,null,"APSA",null,null,null,null,null,null,null,"badminton"]
[]
[null,"S’engager et réaliser des actions techniques d’attaque et de défense en relation avec son projet de jeu",null,null,"DEG 1\n\n\nDEG 2\n\nDEG 3\n\nDEG 4\n",{"$f":"'mise à jour des données'!E3","v":"*De nombreuses fautes : maladresse,Prise de raquette inadaptée.Pas de coup préférentiel efficace : techniques rudimentaires.\nLe service est une simple mise en jeu, le coude en préparation se situe la plupart du temps toujours vers l’avant du corps.\nPeu ou pas de déplacements\n*Utilisation efficace d’un coup préférentiel.L’élève joue de face le plus souvent en frappe haute.Le   service   neutralise  l’attaque\nAdverse ou l’élève a des intentions au service sans forcément y parvenir.Il construit et marque grâce à des renvois dans l’axe central essentiellement.déplacements limités.rupture par des trajectoires variées et accélérées. (smashs, dégagement, amorti) sans y parvenir à chaque fois.\n*Il utilise un ou 2 coups prioritaires efficaces.Variété des services utilisés (vitesses ou longueur /position adverse)frappe de profil\nJoue latéralité ou  profondeur,Déplacements et placements efficaces si peu de pression\n*Frappes de profil, frappes variées et efficaces, déplacements rapides et replacements systématiques.\nVitesse, précision, anticipation, pertinence, coups masqués, construction et équilibre, rapidité, précocité des déplacements."}]
[null,"Faire des choix au regard de l’analyse du rapport de force\net engagement dans le duel.\net engagement dans le duel.",null,null,"cas6\ncas5\ncas4\ncas3\ncas2\ncas1",{"$f":"'mise à jour des données'!$E$4","v":"Gagne les 2 sets en augmentant l’écart sur le second set\nGagne les 2 sets avec dans le 2ème set un écart de pts inférieur ou égal à celui du 1er set\nGagne le second set après avoir perdu le 1er\nPerd le second set après avoir gagné le 1er\nPerd les 2 sets  en réduisant l’écart d’au moins 2 pts sur le second set\nPerd les 2 sets sans évolution positive du score sur le second set "}]
[null,"Gain des rencontres et projet tactique",null,null,"<<4\n<4\n4\n4+\n4++",{"$f":"IF(P$1=\"badminton\",F93,IF(P$1=\"badminton (G)\",F97,IF(P$1=\"badminton (F)\",F101,\"\")))","v":{"$error":"#REF!"}}]
[]
[null,null,null,null,null,null,null,null,null,null,null,null,null,null,null,"            à renseigner pendant l'évaluation",null,null,null,null,null,null,null,null,null,null,null,null,null,null,null,null,null,null,null,null,null,null,null,null,null,null,null,null,null,null,null,null,null,null,null,null,null,null,"pondération"]
[null,"!!NE REMPLIR\nque les cellules grisées.!!",null,null,null,null,null,null,"S’engager et réaliser des actions techniques d’attaque et de défense en relation avec son projet de jeu",null,null,null,null,null,"Niveau","Faire des choix au regard de l’analyse du rapport de force\net engagement dans le duel.",null,null,null,null,null,null,null,null,null,null,null,null,"AFL 2",null,null,null,null,null,null,null,null,null,null,null,"AFL 3",null,null,null,null,null,null,null,null,"TOTAL","G","F","TOTAL"]
[null,null,null,null,null,null,null,null,null,null,null,null,null,null,null,null,null,null,null,null,null,null,null,null,null,null,null,null,null,null,null,null,null,null,null,null,null,null,null,null,null,null,null,null,null,null,null,null,null,null,null,null,null,null,"Pondération"]
["N°","classe","NOM","PRENOM","sexe","poule","place",null,"DEGRE\nMATRISE","Nbre matchs Gagnés","ajustement",null,"/ 12","Pondération",null,"match 1","match 2","match 3","match 4","match 5","match 6",null,null,null,null,null,null,"/ 4","DEGRE\nMATRISE","Pondération",null,null,null,null,null,null,"points","ajustement","NOTE","/ 2","DEGRE\nMATRISE","Pondération","poule","place",null,"n/p","n/c","NOTE","/ 2","/ 20",null,null,"/ 20",null,{"$f":"IF(BC8=\"\",\"NOTE\",\"NOTE pondérée\")","v":"NOTE"}]
[1,1,{"$f":"IF(matchs!C7=\"\",\"\",matchs!C7)","v":0},{"$f":"IF(matchs!D7=\"\",\"\",matchs!D7)","v":0},{"$f":"IF(matchs!E7=\"\",\"\",matchs!E7)","v":"G"},{"$f":"IF(matchs!F7=\"\",\"\",matchs!F7)","v":1},{"$f":"IF(matchs!$EB7=\"\",\"\",matchs!$EB7)","v":1},null,null,3,{"$f":"IF(J11=\"\",\"\",IF($O11=\"A\",VLOOKUP(J11,GAGNES,2),IF($O11=\"B\",VLOOKUP(J11,GAGNES,3),IF($O11=\"C\",VLOOKUP(J11,GAGNES,4),IF($O11=\"D\",VLOOKUP(J11,GAGNES,5),\"\")))))","v":""},{"$f":"IF(I11=\"\",\"\",IF(I11=\"DEG 1\",4,IF(I11=\"DEG 2\",6,IF(I11=\"DEG 3\",8,IF(I11=\"DEG 4\",12)))))","v":""},{"$f":"IF(L11=\"\",\"\",SUM(K11,L11,N11))","v":""},null,{"$f":"IF(I11=\"\",\"\",LOOKUP(I11,code))","v":""},{"$f":"IF(matchs!$Q7=\"\",\"\",matchs!$Q7)","v":"cas4"},{"$f":"IF(matchs!$AB7=\"\",\"\",matchs!$AB7)","v":"cas5"},{"$f":"IF(matchs!$AM7=\"\",\"\",matchs!$AM7)","v":"cas5"},{"$f":"IF(matchs!$AX7=\"\",\"\",matchs!$AX7)","v":""},{"$f":"IF(matchs!$BI7=\"\",\"\",matchs!$BI7)","v":""},{"$f":"IF(matchs!$BT7=\"\",\"\",matchs!$BT7)","v":""},{"$f":"IF(P11=\"\",\"\",IF($O11=\"A\",VLOOKUP(P11,cass,2),IF($O11=\"B\",VLOOKUP(P11,cass,3),IF($O11=\"C\",VLOOKUP(P11,cass,4),IF($O11=\"D\",VLOOKUP(P11,cass,5),\"\")))))","v":""},{"$f":"IF(Q11=\"\",\"\",IF($O11=\"A\",VLOOKUP(Q11,cass,2),IF($O11=\"B\",VLOOKUP(Q11,cass,3),IF($O11=\"C\",VLOOKUP(Q11,cass,4),IF($O11=\"D\",VLOOKUP(Q11,cass,5),\"\")))))","v":""},{"$f":"IF(R11=\"\",\"\",IF($O11=\"A\",VLOOKUP(R11,cass,2),IF($O11=\"B\",VLOOKUP(R11,cass,3),IF($O11=\"C\",VLOOKUP(R11,cass,4),IF($O11=\"D\",VLOOKUP(R11,cass,5),\"\")))))","v":""},{"$f":"IF(S11=\"\",\"\",IF($O11=\"A\",VLOOKUP(S11,cass,2),IF($O11=\"B\",VLOOKUP(S11,cass,3),IF($O11=\"C\",VLOOKUP(S11,cass,4),IF($O11=\"D\",VLOOKUP(S11,cass,5),\"\")))))","v":""},{"$f":"IF(T11=\"\",\"\",IF($O11=\"A\",VLOOKUP(T11,cass,2),IF($O11=\"B\",VLOOKUP(T11,cass,3),IF($O11=\"C\",VLOOKUP(T11,cass,4),IF($O11=\"D\",VLOOKUP(T11,cass,5),\"\")))))","v":""},{"$f":"IF(U11=\"\",\"\",IF($O11=\"A\",VLOOKUP(U11,cass,2),IF($O11=\"B\",VLOOKUP(U11,cass,3),IF($O11=\"C\",VLOOKUP(U11,cass,4),IF($O11=\"D\",VLOOKUP(U11,cass,5),\"\")))))","v":""},{"$f":"IF(COUNT(V11:AA11)<1,\"\",AVERAGE(V11:AA11))","v":""},"DEG 4",null,null,null,null,null,null,null,null,null,{"$f":"IF(AC11=\"\",\"\",LOOKUP(AC11,AFL))","v":2},{"$f":"IF(AC11=\"\",\"\",SUM(AD11,AM11))","v":2},"DEG 2",-0.75,null,null,null,null,null,{"$f":"IF(AO11=\"\",\"\",LOOKUP(AO11,AFL))","v":1},{"$f":"IF(AO11=\"\",\"\",SUM(AP11,AV11))","v":0.25},{"$f":"IF(COUNT(M11,AB11,AN11,AW11)<1,\"\",SUM(M11,AB11,AN11,AW11))","v":2.25},{"$f":"IF(E11=\"G\",AX11,\"\")","v":2.25},{"$f":"IF(E11=\"F\",AX11,\"\")","v":""},{"$f":"IF(AX11=\"\",\"\",ROUNDUP(AX11*4,0)/4)","v":2.25},null,{"$f":"IF(BA11=\"\",\"\",IF(BA11+BC$8>20,20,BA11+BC$8))","v":2.25}]
[2,1,{"$f":"IF(matchs!C8=\"\",\"\",matchs!C8)","v":0},{"$f":"IF(matchs!D8=\"\",\"\",matchs!D8)","v":0},{"$f":"IF(matchs!E8=\"\",\"\",matchs!E8)","v":"G"},{"$f":"IF(matchs!F8=\"\",\"\",matchs!F8)","v":1},{"$f":"IF(matchs!$EB8=\"\",\"\",matchs!$EB8)","v":2},null,null,2,"",{"$f":"IF(I12=\"\",\"\",IF(I12=\"DEG 1\",4,IF(I12=\"DEG 2\",6,IF(I12=\"DEG 3\",8,IF(I12=\"DEG 4\",12)))))","v":""},{"$f":"IF(L12=\"\",\"\",SUM(K12,L12,N12))","v":""},null,"",{"$f":"IF(matchs!$Q8=\"\",\"\",matchs!$Q8)","v":"cas3"},{"$f":"IF(matchs!$AB8=\"\",\"\",matchs!$AB8)","v":"cas5"},{"$f":"IF(matchs!$AM8=\"\",\"\",matchs!$AM8)","v":"cas1"},{"$f":"IF(matchs!$AX8=\"\",\"\",matchs!$AX8)","v":""},{"$f":"IF(matchs!$BI8=\"\",\"\",matchs!$BI8)","v":""},{"$f":"IF(matchs!$BT8=\"\",\"\",matchs!$BT8)","v":""},{"$f":"IF(P12=\"\",\"\",IF($O12=\"A\",VLOOKUP(P12,cass,2),IF($O12=\"B\",VLOOKUP(P12,cass,3),IF($O12=\"C\",VLOOKUP(P12,cass,4),IF($O12=\"D\",VLOOKUP(P12,cass,5),\"\")))))","v":""},"","","","","",{"$f":"IF(COUNT(V12:AA12)<1,\"\",AVERAGE(V12:AA12))","v":""},null,null,null,null,null,null,null,null,null,null,"",{"$f":"IF(AC12=\"\",\"\",SUM(AD12,AM12))","v":""},"DEG 2",null,null,null,null,null,null,1,{"$f":"IF(AO12=\"\",\"\",SUM(AP12,AV12))","v":1},{"$f":"IF(COUNT(M12,AB12,AN12,AW12)<1,\"\",SUM(M12,AB12,AN12,AW12))","v":1},1,"",{"$f":"IF(AX12=\"\",\"\",ROUNDUP(AX12*4,0)/4)","v":1},null,1]
[3,1,{"$f":"IF(matchs!C9=\"\",\"\",matchs!C9)","v":0},{"$f":"IF(matchs!D9=\"\",\"\",matchs!D9)","v":0},{"$f":"IF(matchs!E9=\"\",\"\",matchs!E9)","v":"G"},{"$f":"IF(matchs!F9=\"\",\"\",matchs!F9)","v":1},{"$f":"IF(matchs!$EB9=\"\",\"\",matchs!$EB9)","v":4},null,null,null,"","","",-1,"",{"$f":"IF(matchs!$Q9=\"\",\"\",matchs!$Q9)","v":"cas4"},{"$f":"IF(matchs!$AB9=\"\",\"\",matchs!$AB9)","v":"cas1"},{"$f":"IF(matchs!$AM9=\"\",\"\",matchs!$AM9)","v":"cas2"},{"$f":"IF(matchs!$AX9=\"\",\"\",matchs!$AX9)","v":""},{"$f":"IF(matchs!$BI9=\"\",\"\",matchs!$BI9)","v":""},{"$f":"IF(matchs!$BT9=\"\",\"\",matchs!$BT9)","v":""},"","","","","","","","DEG 3",null,null,null,null,null,null,null,null,null,1.5,1.5,"DEG 4",null,null,null,null,null,null,2,2,3.5,3.5,"",3.5,null,3.5]
[4,2,{"$f":"IF(matchs!C10=\"\",\"\",matchs!C10)","v":0},{"$f":"IF(matchs!D10=\"\",\"\",matchs!D10)","v":0},{"$f":"IF(matchs!E10=\"\",\"\",matchs!E10)","v":"G"},{"$f":"IF(matchs!F10=\"\",\"\",matchs!F10)","v":1},{"$f":"IF(matchs!$EB10=\"\",\"\",matchs!$EB10)","v":3},null,null,null,"","","",null,"",{"$f":"IF(matchs!$Q10=\"\",\"\",matchs!$Q10)","v":"cas3"},{"$f":"IF(matchs!$AB10=\"\",\"\",matchs!$AB10)","v":"cas2"},{"$f":"IF(matchs!$AM10=\"\",\"\",matchs!$AM10)","v":"cas5"},{"$f":"IF(matchs!$AX10=\"\",\"\",matchs!$AX10)","v":""},{"$f":"IF(matchs!$BI10=\"\",\"\",matchs!$BI10)","v":""},{"$f":"IF(matchs!$BT10=\"\",\"\",matchs!$BT10)","v":""},"","","","","","","",null,null,null,null,null,null,null,null,null,null,"","",null,null,null,null,null,null,null,"","","","","","",null,""]
[5,3,{"$f":"IF(matchs!C11=\"\",\"\",matchs!C11)","v":0},{"$f":"IF(matchs!D11=\"\",\"\",matchs!D11)","v":0},{"$f":"IF(matchs!E11=\"\",\"\",matchs!E11)","v":"G"},{"$f":"IF(matchs!F11=\"\",\"\",matchs!F11)","v":2},{"$f":"IF(matchs!$EB11=\"\",\"\",matchs!$EB11)","v":5},null,null,null,"","","",null,"",{"$f":"IF(matchs!$Q11=\"\",\"\",matchs!$Q11)","v":"cas3"},{"$f":"IF(matchs!$AB11=\"\",\"\",matchs!$AB11)","v":"cas5"},{"$f":"IF(matchs!$AM11=\"\",\"\",matchs!$AM11)","v":"cas5"},{"$f":"IF(matchs!$AX11=\"\",\"\",matchs!$AX11)","v":""},{"$f":"IF(matchs!$BI11=\"\",\"\",matchs!$BI11)","v":""},{"$f":"IF(matchs!$BT11=\"\",\"\",matchs!$BT11)","v":""},"","","","","","","",null,null,null,null,null,null,null,null,null,null,"","",null,null,null,null,null,null,null,"","","","","","",null,""]
[6,3,{"$f":"IF(matchs!C12=\"\",\"\",matchs!C12)","v":0},{"$f":"IF(matchs!D12=\"\",\"\",matchs!D12)","v":0},{"$f":"IF(matchs!E12=\"\",\"\",matchs!E12)","v":"F"},{"$f":"IF(matchs!F12=\"\",\"\",matchs!F12)","v":2},{"$f":"IF(matchs!$EB12=\"\",\"\",matchs!$EB12)","v":2},null,null,null,"","","",null,"",{"$f":"IF(matchs!$Q12=\"\",\"\",matchs!$Q12)","v":"cas4"},{"$f":"IF(matchs!$AB12=\"\",\"\",matchs!$AB12)","v":"cas2"},{"$f":"IF(matchs!$AM12=\"\",\"\",matchs!$AM12)","v":""},{"$f":"IF(matchs!$AX12=\"\",\"\",matchs!$AX12)","v":""},{"$f":"IF(matchs!$BI12=\"\",\"\",matchs!$BI12)","v":""},{"$f":"IF(matchs!$BT12=\"\",\"\",matchs!$BT12)","v":""},"","","","","","","",null,null,null,null,null,null,null,null,null,null,"","",null,null,null,null,null,null,null,"","","","","","",null,""]
[7,4,{"$f":"IF(matchs!C13=\"\",\"\",matchs!C13)","v":0},{"$f":"IF(matchs!D13=\"\",\"\",matchs!D13)","v":0},{"$f":"IF(matchs!E13=\"\",\"\",matchs!E13)","v":"F"},{"$f":"IF(matchs!F13=\"\",\"\",matchs!F13)","v":2},{"$f":"IF(matchs!$EB13=\"\",\"\",matchs!$EB13)","v":1},null,null,null,"","","",null,"",{"$f":"IF(matchs!$Q13=\"\",\"\",matchs!$Q13)","v":"cas6"},{"$f":"IF(matchs!$AB13=\"\",\"\",matchs!$AB13)","v":"cas5"},{"$f":"IF(matchs!$AM13=\"\",\"\",matchs!$AM13)","v":"cas1"},{"$f":"IF(matchs!$AX13=\"\",\"\",matchs!$AX13)","v":""},{"$f":"IF(matchs!$BI13=\"\",\"\",matchs!$BI13)","v":""},{"$f":"IF(matchs!$BT13=\"\",\"\",matchs!$BT13)","v":""},"","","","","","","",null,null,null,null,null,null,null,null,null,null,"","",null,null,null,null,null,null,null,"","","","","","",null,""]
[8,5,{"$f":"IF(matchs!C14=\"\",\"\",matchs!C14)","v":0},{"$f":"IF(matchs!D14=\"\",\"\",matchs!D14)","v":0},{"$f":"IF(matchs!E14=\"\",\"\",matchs!E14)","v":"G"},{"$f":"IF(matchs!F14=\"\",\"\",matchs!F14)","v":2},{"$f":"IF(matchs!$EB14=\"\",\"\",matchs!$EB14)","v":7},null,null,null,"","","",null,"",{"$f":"IF(matchs!$Q14=\"\",\"\",matchs!$Q14)","v":"cas1"},{"$f":"IF(matchs!$AB14=\"\",\"\",matchs!$AB14)","v":"cas1"},{"$f":"IF(matchs!$AM14=\"\",\"\",matchs!$AM14)","v":""},{"$f":"IF(matchs!$AX14=\"\",\"\",matchs!$AX14)","v":""},{"$f":"IF(matchs!$BI14=\"\",\"\",matchs!$BI14)","v":""},{"$f":"IF(matchs!$BT14=\"\",\"\",matchs!$BT14)","v":""},"","","","","","","",null,null,null,null,null,null,null,null,null,null,"","",null,null,null,null,null,null,null,"","","","","","",null,""]
[9,5,{"$f":"IF(matchs!C15=\"\",\"\",matchs!C15)","v":0},{"$f":"IF(matchs!D15=\"\",\"\",matchs!D15)","v":0},{"$f":"IF(matchs!E15=\"\",\"\",matchs!E15)","v":"G"},{"$f":"IF(matchs!F15=\"\",\"\",matchs!F15)","v":3},{"$f":"IF(matchs!$EB15=\"\",\"\",matchs!$EB15)","v":7},null,null,null,"","","",null,"",{"$f":"IF(matchs!$Q15=\"\",\"\",matchs!$Q15)","v":"cas6"},{"$f":"IF(matchs!$AB15=\"\",\"\",matchs!$AB15)","v":"cas1"},{"$f":"IF(matchs!$AM15=\"\",\"\",matchs!$AM15)","v":"cas3"},{"$f":"IF(matchs!$AX15=\"\",\"\",matchs!$AX15)","v":""},{"$f":"IF(matchs!$BI15=\"\",\"\",matchs!$BI15)","v":""},{"$f":"IF(matchs!$BT15=\"\",\"\",matchs!$BT15)","v":""},"","","","","","","",null,null,null,null,null,null,null,null,null,null,"","",null,null,null,null,null,null,null,"","","","","","",null,""]
[10,4,{"$f":"IF(matchs!C16=\"\",\"\",matchs!C16)","v":0},{"$f":"IF(matchs!D16=\"\",\"\",matchs!D16)","v":0},{"$f":"IF(matchs!E16=\"\",\"\",matchs!E16)","v":"G"},{"$f":"IF(matchs!F16=\"\",\"\",matchs!F16)","v":3},{"$f":"IF(matchs!$EB16=\"\",\"\",matchs!$EB16)","v":6},null,null,null,"","","",null,"",{"$f":"IF(matchs!$Q16=\"\",\"\",matchs!$Q16)","v":"cas5"},{"$f":"IF(matchs!$AB16=\"\",\"\",matchs!$AB16)","v":"cas6"},{"$f":"IF(matchs!$AM16=\"\",\"\",matchs!$AM16)","v":"cas6"},{"$f":"IF(matchs!$AX16=\"\",\"\",matchs!$AX16)","v":""},{"$f":"IF(matchs!$BI16=\"\",\"\",matchs!$BI16)","v":""},{"$f":"IF(matchs!$BT16=\"\",\"\",matchs!$BT16)","v":""},"","","","","","","",null,null,null,null,null,null,null,null,null,null,"","",null,null,null,null,null,null,null,"","","","","","",null,""]
[11,6,{"$f":"IF(matchs!C17=\"\",\"\",matchs!C17)","v":0},{"$f":"IF(matchs!D17=\"\",\"\",matchs!D17)","v":0},{"$f":"IF(matchs!E17=\"\",\"\",matchs!E17)","v":"F"},{"$f":"IF(matchs!F17=\"\",\"\",matchs!F17)","v":3},{"$f":"IF(matchs!$EB17=\"\",\"\",matchs!$EB17)","v":3},null,null,null,"","","",null,"",{"$f":"IF(matchs!$Q17=\"\",\"\",matchs!$Q17)","v":"cas1"},{"$f":"IF(matchs!$AB17=\"\",\"\",matchs!$AB17)","v":"cas1"},{"$f":"IF(matchs!$AM17=\"\",\"\",matchs!$AM17)","v":"cas1"},{"$f":"IF(matchs!$AX17=\"\",\"\",matchs!$AX17)","v":""},{"$f":"IF(matchs!$BI17=\"\",\"\",matchs!$BI17)","v":""},{"$f":"IF(matchs!$BT17=\"\",\"\",matchs!$BT17)","v":""},"","","","","","","",null,null,null,null,null,null,null,null,null,null,"","",null,null,null,null,null,null,null,"","","","","","",null,""]
[12,6,{"$f":"IF(matchs!C18=\"\",\"\",matchs!C18)","v":0},{"$f":"IF(matchs!D18=\"\",\"\",matchs!D18)","v":0},{"$f":"IF(matchs!E18=\"\",\"\",matchs!E18)","v":"G"},{"$f":"IF(matchs!F18=\"\",\"\",matchs!F18)","v":3},{"$f":"IF(matchs!$EB18=\"\",\"\",matchs!$EB18)","v":9},null,null,null,"","","",null,"",{"$f":"IF(matchs!$Q18=\"\",\"\",matchs!$Q18)","v":"cas2"},{"$f":"IF(matchs!$AB18=\"\",\"\",matchs!$AB18)","v":"cas6"},{"$f":"IF(matchs!$AM18=\"\",\"\",matchs!$AM18)","v":"cas4"},{"$f":"IF(matchs!$AX18=\"\",\"\",matchs!$AX18)","v":""},{"$f":"IF(matchs!$BI18=\"\",\"\",matchs!$BI18)","v":""},{"$f":"IF(matchs!$BT18=\"\",\"\",matchs!$BT18)","v":""},"","","","","","","",null,null,null,null,null,null,null,null,null,null,"","",null,null,null,null,null,null,null,"","","","","","",null,""]
[13,7,{"$f":"IF(matchs!C19=\"\",\"\",matchs!C19)","v":0},{"$f":"IF(matchs!D19=\"\",\"\",matchs!D19)","v":0},{"$f":"IF(matchs!E19=\"\",\"\",matchs!E19)","v":"G"},{"$f":"IF(matchs!F19=\"\",\"\",matchs!F19)","v":4},{"$f":"IF(matchs!$EB19=\"\",\"\",matchs!$EB19)","v":10},null,null,null,"","","",null,"",{"$f":"IF(matchs!$Q19=\"\",\"\",matchs!$Q19)","v":""},{"$f":"IF(matchs!$AB19=\"\",\"\",matchs!$AB19)","v":"cas5"},{"$f":"IF(matchs!$AM19=\"\",\"\",matchs!$AM19)","v":"cas5"},{"$f":"IF(matchs!$AX19=\"\",\"\",matchs!$AX19)","v":""},{"$f":"IF(matchs!$BI19=\"\",\"\",matchs!$BI19)","v":""},{"$f":"IF(matchs!$BT19=\"\",\"\",matchs!$BT19)","v":""},"","","","","","","",null,null,null,null,null,null,null,null,null,null,"","",null,null,null,null,null,null,null,"","","","","","",null,""]
[14,7,{"$f":"IF(matchs!C20=\"\",\"\",matchs!C20)","v":0},{"$f":"IF(matchs!D20=\"\",\"\",matchs!D20)","v":0},{"$f":"IF(matchs!E20=\"\",\"\",matchs!E20)","v":"G"},{"$f":"IF(matchs!F20=\"\",\"\",matchs!F20)","v":4},{"$f":"IF(matchs!$EB20=\"\",\"\",matchs!$EB20)","v":11},null,null,null,"","","",null,"",{"$f":"IF(matchs!$Q20=\"\",\"\",matchs!$Q20)","v":"cas6"},{"$f":"IF(matchs!$AB20=\"\",\"\",matchs!$AB20)","v":"cas1"},{"$f":"IF(matchs!$AM20=\"\",\"\",matchs!$AM20)","v":"cas5"},{"$f":"IF(matchs!$AX20=\"\",\"\",matchs!$AX20)","v":""},{"$f":"IF(matchs!$BI20=\"\",\"\",matchs!$BI20)","v":""},{"$f":"IF(matchs!$BT20=\"\",\"\",matchs!$BT20)","v":""},"","","","","","","",null,null,null,null,null,null,null,null,null,null,"","",null,null,null,null,null,null,null,"","","","","","",null,""]
[15,9,{"$f":"IF(matchs!C21=\"\",\"\",matchs!C21)","v":0},{"$f":"IF(matchs!D21=\"\",\"\",matchs!D21)","v":0},{"$f":"IF(matchs!E21=\"\",\"\",matchs!E21)","v":"F"},{"$f":"IF(matchs!F21=\"\",\"\",matchs!F21)","v":4},{"$f":"IF(matchs!$EB21=\"\",\"\",matchs!$EB21)","v":6},null,null,null,"","","",null,"",{"$f":"IF(matchs!$Q21=\"\",\"\",matchs!$Q21)","v":"cas1"},{"$f":"IF(matchs!$AB21=\"\",\"\",matchs!$AB21)","v":"cas2"},{"$f":"IF(matchs!$AM21=\"\",\"\",matchs!$AM21)","v":"cas2"},{"$f":"IF(matchs!$AX21=\"\",\"\",matchs!$AX21)","v":""},{"$f":"IF(matchs!$BI21=\"\",\"\",matchs!$BI21)","v":""},{"$f":"IF(matchs!$BT21=\"\",\"\",matchs!$BT21)","v":""},"","","","","","","",null,null,null,null,null,null,null,null,null,null,"","",null,null,null,null,null,null,null,"","","","","","",null,""]
[16,8,{"$f":"IF(matchs!C22=\"\",\"\",matchs!C22)","v":0},{"$f":"IF(matchs!D22=\"\",\"\",matchs!D22)","v":0},{"$f":"IF(matchs!E22=\"\",\"\",matchs!E22)","v":"F"},{"$f":"IF(matchs!F22=\"\",\"\",matchs!F22)","v":4},{"$f":"IF(matchs!$EB22=\"\",\"\",matchs!$EB22)","v":3},null,null,null,"","","",null,"",{"$f":"IF(matchs!$Q22=\"\",\"\",matchs!$Q22)","v":""},{"$f":"IF(matchs!$AB22=\"\",\"\",matchs!$AB22)","v":"cas5"},{"$f":"IF(matchs!$AM22=\"\",\"\",matchs!$AM22)","v":"cas2"},{"$f":"IF(matchs!$AX22=\"\",\"\",matchs!$AX22)","v":""},{"$f":"IF(matchs!$BI22=\"\",\"\",matchs!$BI22)","v":""},{"$f":"IF(matchs!$BT22=\"\",\"\",matchs!$BT22)","v":""},"","","","","","","",null,null,null,null,null,null,null,null,null,null,"","",null,null,null,null,null,null,null,"","","","","","",null,""]
[17,8,{"$f":"IF(matchs!C23=\"\",\"\",matchs!C23)","v":0},{"$f":"IF(matchs!D23=\"\",\"\",matchs!D23)","v":0},{"$f":"IF(matchs!E23=\"\",\"\",matchs!E23)","v":"F"},{"$f":"IF(matchs!F23=\"\",\"\",matchs!F23)","v":5},{"$f":"IF(matchs!$EB23=\"\",\"\",matchs!$EB23)","v":3},null,null,null,"","","",null,"",{"$f":"IF(matchs!$Q23=\"\",\"\",matchs!$Q23)","v":"cas4"},{"$f":"IF(matchs!$AB23=\"\",\"\",matchs!$AB23)","v":"cas5"},{"$f":"IF(matchs!$AM23=\"\",\"\",matchs!$AM23)","v":"cas1"},{"$f":"IF(matchs!$AX23=\"\",\"\",matchs!$AX23)","v":""},{"$f":"IF(matchs!$BI23=\"\",\"\",matchs!$BI23)","v":""},{"$f":"IF(matchs!$BT23=\"\",\"\",matchs!$BT23)","v":""},"","","","","","","",null,null,null,null,null,null,null,null,null,null,"","",null,null,null,null,null,null,null,"","","","","","",null,""]
[18,7,{"$f":"IF(matchs!C24=\"\",\"\",matchs!C24)","v":0},{"$f":"IF(matchs!D24=\"\",\"\",matchs!D24)","v":0},{"$f":"IF(matchs!E24=\"\",\"\",matchs!E24)","v":"G"},{"$f":"IF(matchs!F24=\"\",\"\",matchs!F24)","v":5},{"$f":"IF(matchs!$EB24=\"\",\"\",matchs!$EB24)","v":12},null,null,null,"","","",null,"",{"$f":"IF(matchs!$Q24=\"\",\"\",matchs!$Q24)","v":"cas3"},{"$f":"IF(matchs!$AB24=\"\",\"\",matchs!$AB24)","v":"cas1"},{"$f":"IF(matchs!$AM24=\"\",\"\",matchs!$AM24)","v":"cas5"},{"$f":"IF(matchs!$AX24=\"\",\"\",matchs!$AX24)","v":""},{"$f":"IF(matchs!$BI24=\"\",\"\",matchs!$BI24)","v":""},{"$f":"IF(matchs!$BT24=\"\",\"\",matchs!$BT24)","v":""},"","","","","","","",null,null,null,null,null,null,null,null,null,null,"","",null,null,null,null,null,null,null,"","","","","","",null,""]
[19,10,{"$f":"IF(matchs!C25=\"\",\"\",matchs!C25)","v":0},{"$f":"IF(matchs!D25=\"\",\"\",matchs!D25)","v":0},{"$f":"IF(matchs!E25=\"\",\"\",matchs!E25)","v":"F"},{"$f":"IF(matchs!F25=\"\",\"\",matchs!F25)","v":5},{"$f":"IF(matchs!$EB25=\"\",\"\",matchs!$EB25)","v":7},null,null,null,"","","",null,"",{"$f":"IF(matchs!$Q25=\"\",\"\",matchs!$Q25)","v":"cas4"},{"$f":"IF(matchs!$AB25=\"\",\"\",matchs!$AB25)","v":"cas2"},{"$f":"IF(matchs!$AM25=\"\",\"\",matchs!$AM25)","v":"cas5"},{"$f":"IF(matchs!$AX25=\"\",\"\",matchs!$AX25)","v":""},{"$f":"IF(matchs!$BI25=\"\",\"\",matchs!$BI25)","v":""},{"$f":"IF(matchs!$BT25=\"\",\"\",matchs!$BT25)","v":""},"","","","","","","",null,null,null,null,null,null,null,null,null,null,"","",null,null,null,null,null,null,null,"","","","","","",null,""]
[20,11,{"$f":"IF(matchs!C26=\"\",\"\",matchs!C26)","v":0},{"$f":"IF(matchs!D26=\"\",\"\",matchs!D26)","v":0},{"$f":"IF(matchs!E26=\"\",\"\",matchs!E26)","v":"F"},{"$f":"IF(matchs!F26=\"\",\"\",matchs!F26)","v":5},{"$f":"IF(matchs!$EB26=\"\",\"\",matchs!$EB26)","v":8},null,null,null,"","","",null,"",{"$f":"IF(matchs!$Q26=\"\",\"\",matchs!$Q26)","v":"cas3"},{"$f":"IF(matchs!$AB26=\"\",\"\",matchs!$AB26)","v":"cas5"},{"$f":"IF(matchs!$AM26=\"\",\"\",matchs!$AM26)","v":"cas1"},{"$f":"IF(matchs!$AX26=\"\",\"\",matchs!$AX26)","v":""},{"$f":"IF(matchs!$BI26=\"\",\"\",matchs!$BI26)","v":""},{"$f":"IF(matchs!$BT26=\"\",\"\",matchs!$BT26)","v":""},"","","","","","","",null,null,null,null,null,null,null,null,null,null,"","",null,null,null,null,null,null,null,"","","","","","",null,""]
[21,13,{"$f":"IF(matchs!C27=\"\",\"\",matchs!C27)","v":0},{"$f":"IF(matchs!D27=\"\",\"\",matchs!D27)","v":0},{"$f":"IF(matchs!E27=\"\",\"\",matchs!E27)","v":"F"},{"$f":"IF(matchs!F27=\"\",\"\",matchs!F27)","v":6},{"$f":"IF(matchs!$EB27=\"\",\"\",matchs!$EB27)","v":11},null,null,null,"","","",null,"",{"$f":"IF(matchs!$Q27=\"\",\"\",matchs!$Q27)","v":"cas2"},{"$f":"IF(matchs!$AB27=\"\",\"\",matchs!$AB27)","v":"cas1"},{"$f":"IF(matchs!$AM27=\"\",\"\",matchs!$AM27)","v":""},{"$f":"IF(matchs!$AX27=\"\",\"\",matchs!$AX27)","v":""},{"$f":"IF(matchs!$BI27=\"\",\"\",matchs!$BI27)","v":""},{"$f":"IF(matchs!$BT27=\"\",\"\",matchs!$BT27)","v":""},"","","","","","","",null,null,null,null,null,null,null,null,null,null,"","",null,null,null,null,null,null,null,"","","","","","",null,""]
[22,12,{"$f":"IF(matchs!C28=\"\",\"\",matchs!C28)","v":0},{"$f":"IF(matchs!D28=\"\",\"\",matchs!D28)","v":0},{"$f":"IF(matchs!E28=\"\",\"\",matchs!E28)","v":"F"},{"$f":"IF(matchs!F28=\"\",\"\",matchs!F28)","v":6},{"$f":"IF(matchs!$EB28=\"\",\"\",matchs!$EB28)","v":9},null,null,null,"","","",null,"",{"$f":"IF(matchs!$Q28=\"\",\"\",matchs!$Q28)","v":"cas3"},{"$f":"IF(matchs!$AB28=\"\",\"\",matchs!$AB28)","v":"cas3"},{"$f":"IF(matchs!$AM28=\"\",\"\",matchs!$AM28)","v":""},{"$f":"IF(matchs!$AX28=\"\",\"\",matchs!$AX28)","v":""},{"$f":"IF(matchs!$BI28=\"\",\"\",matchs!$BI28)","v":""},{"$f":"IF(matchs!$BT28=\"\",\"\",matchs!$BT28)","v":""},"","","","","","","",null,null,null,null,null,null,null,null,null,null,"","",null,null,null,null,null,null,null,"","","","","","",null,""]
[23,14,{"$f":"IF(matchs!C29=\"\",\"\",matchs!C29)","v":0},{"$f":"IF(matchs!D29=\"\",\"\",matchs!D29)","v":0},{"$f":"IF(matchs!E29=\"\",\"\",matchs!E29)","v":"G"},{"$f":"IF(matchs!F29=\"\",\"\",matchs!F29)","v":6},{"$f":"IF(matchs!$EB29=\"\",\"\",matchs!$EB29)","v":12},null,null,null,"","","",null,"",{"$f":"IF(matchs!$Q29=\"\",\"\",matchs!$Q29)","v":"cas4"},{"$f":"IF(matchs!$AB29=\"\",\"\",matchs!$AB29)","v":"cas5"},{"$f":"IF(matchs!$AM29=\"\",\"\",matchs!$AM29)","v":""},{"$f":"IF(matchs!$AX29=\"\",\"\",matchs!$AX29)","v":""},{"$f":"IF(matchs!$BI29=\"\",\"\",matchs!$BI29)","v":""},{"$f":"IF(matchs!$BT29=\"\",\"\",matchs!$BT29)","v":""},"","","","","","","",null,null,null,null,null,null,null,null,null,null,"","",null,null,null,null,null,null,null,"","","","","","",null,""]
[24,15,{"$f":"IF(matchs!C30=\"\",\"\",matchs!C30)","v":0},{"$f":"IF(matchs!D30=\"\",\"\",matchs!D30)","v":0},{"$f":"IF(matchs!E30=\"\",\"\",matchs!E30)","v":"G"},{"$f":"IF(matchs!F30=\"\",\"\",matchs!F30)","v":6},{"$f":"IF(matchs!$EB30=\"\",\"\",matchs!$EB30)","v":14},null,null,null,"","","",null,"",{"$f":"IF(matchs!$Q30=\"\",\"\",matchs!$Q30)","v":"cas5"},{"$f":"IF(matchs!$AB30=\"\",\"\",matchs!$AB30)","v":"cas4"},{"$f":"IF(matchs!$AM30=\"\",\"\",matchs!$AM30)","v":""},{"$f":"IF(matchs!$AX30=\"\",\"\",matchs!$AX30)","v":""},{"$f":"IF(matchs!$BI30=\"\",\"\",matchs!$BI30)","v":""},{"$f":"IF(matchs!$BT30=\"\",\"\",matchs!$BT30)","v":""},"","","","","","","",null,null,null,null,null,null,null,null,null,null,"","",null,null,null,null,null,null,null,"","","","","","",null,""]
[25,16,{"$f":"IF(matchs!C31=\"\",\"\",matchs!C31)","v":0},{"$f":"IF(matchs!D31=\"\",\"\",matchs!D31)","v":0},{"$f":"IF(matchs!E31=\"\",\"\",matchs!E31)","v":"F"},{"$f":"IF(matchs!F31=\"\",\"\",matchs!F31)","v":7},{"$f":"IF(matchs!$EB31=\"\",\"\",matchs!$EB31)","v":9},null,null,null,"","","",null,"",{"$f":"IF(matchs!$Q31=\"\",\"\",matchs!$Q31)","v":"cas6"},{"$f":"IF(matchs!$AB31=\"\",\"\",matchs!$AB31)","v":"cas5"},{"$f":"IF(matchs!$AM31=\"\",\"\",matchs!$AM31)","v":"cas5"},{"$f":"IF(matchs!$AX31=\"\",\"\",matchs!$AX31)","v":""},{"$f":"IF(matchs!$BI31=\"\",\"\",matchs!$BI31)","v":""},{"$f":"IF(matchs!$BT31=\"\",\"\",matchs!$BT31)","v":""},"","","","","","","",null,null,null,null,null,null,null,null,null,null,"","",null,null,null,null,null,null,null,"","","","","","",null,""]
[26,17,{"$f":"IF(matchs!C32=\"\",\"\",matchs!C32)","v":0},{"$f":"IF(matchs!D32=\"\",\"\",matchs!D32)","v":0},{"$f":"IF(matchs!E32=\"\",\"\",matchs!E32)","v":"F"},{"$f":"IF(matchs!F32=\"\",\"\",matchs!F32)","v":7},{"$f":"IF(matchs!$EB32=\"\",\"\",matchs!$EB32)","v":14},null,null,null,"","","",null,"",{"$f":"IF(matchs!$Q32=\"\",\"\",matchs!$Q32)","v":"cas4"},{"$f":"IF(matchs!$AB32=\"\",\"\",matchs!$AB32)","v":"cas2"},{"$f":"IF(matchs!$AM32=\"\",\"\",matchs!$AM32)","v":"cas2"},{"$f":"IF(matchs!$AX32=\"\",\"\",matchs!$AX32)","v":""},{"$f":"IF(matchs!$BI32=\"\",\"\",matchs!$BI32)","v":""},{"$f":"IF(matchs!$BT32=\"\",\"\",matchs!$BT32)","v":""},"","","","","","","",null,null,null,null,null,null,null,null,null,null,"","",null,null,null,null,null,null,null,"","","","","","",null,""]
[27,{"$f":"IF(matchs!B33=\"\",\"\",matchs!B33)","v":""},{"$f":"IF(matchs!C33=\"\",\"\",matchs!C33)","v":0},{"$f":"IF(matchs!D33=\"\",\"\",matchs!D33)","v":0},{"$f":"IF(matchs!E33=\"\",\"\",matchs!E33)","v":"F"},{"$f":"IF(matchs!F33=\"\",\"\",matchs!F33)","v":7},{"$f":"IF(matchs!$EB33=\"\",\"\",matchs!$EB33)","v":13},null,null,null,"","","",null,"",{"$f":"IF(matchs!$Q33=\"\",\"\",matchs!$Q33)","v":"cas3"},{"$f":"IF(matchs!$AB33=\"\",\"\",matchs!$AB33)","v":"cas1"},{"$f":"IF(matchs!$AM33=\"\",\"\",matchs!$AM33)","v":"cas4"},{"$f":"IF(matchs!$AX33=\"\",\"\",matchs!$AX33)","v":""},{"$f":"IF(matchs!$BI33=\"\",\"\",matchs!$BI33)","v":""},{"$f":"IF(matchs!$BT33=\"\",\"\",matchs!$BT33)","v":""},"","","","","","","",null,null,null,null,null,null,null,null,null,null,"","",null,null,null,null,null,null,null,"","","","","","",null,""]
[28,{"$f":"IF(matchs!B34=\"\",\"\",matchs!B34)","v":""},{"$f":"IF(matchs!C34=\"\",\"\",matchs!C34)","v":0},{"$f":"IF(matchs!D34=\"\",\"\",matchs!D34)","v":0},{"$f":"IF(matchs!E34=\"\",\"\",matchs!E34)","v":"F"},{"$f":"IF(matchs!F34=\"\",\"\",matchs!F34)","v":7},{"$f":"IF(matchs!$EB34=\"\",\"\",matchs!$EB34)","v":11},null,null,null,"","","",null,"",{"$f":"IF(matchs!$Q34=\"\",\"\",matchs!$Q34)","v":"cas1"},{"$f":"IF(matchs!$AB34=\"\",\"\",matchs!$AB34)","v":"cas5"},{"$f":"IF(matchs!$AM34=\"\",\"\",matchs!$AM34)","v":"cas3"},{"$f":"IF(matchs!$AX34=\"\",\"\",matchs!$AX34)","v":""},{"$f":"IF(matchs!$BI34=\"\",\"\",matchs!$BI34)","v":""},{"$f":"IF(matchs!$BT34=\"\",\"\",matchs!$BT34)","v":""},"","","","","","","",null,null,null,null,null,null,null,null,null,null,"","",null,null,null,null,null,null,null,"","","","","","",null,""]
[29,{"$f":"IF(matchs!B35=\"\",\"\",matchs!B35)","v":""},{"$f":"IF(matchs!C35=\"\",\"\",matchs!C35)","v":0},{"$f":"IF(matchs!D35=\"\",\"\",matchs!D35)","v":0},{"$f":"IF(matchs!E35=\"\",\"\",matchs!E35)","v":0},{"$f":"IF(matchs!F35=\"\",\"\",matchs!F35)","v":8},{"$f":"IF(matchs!$EB35=\"\",\"\",matchs!$EB35)","v":30},null,null,null,"","","",null,"",{"$f":"IF(matchs!$Q35=\"\",\"\",matchs!$Q35)","v":""},{"$f":"IF(matchs!$AB35=\"\",\"\",matchs!$AB35)","v":""},{"$f":"IF(matchs!$AM35=\"\",\"\",matchs!$AM35)","v":""},{"$f":"IF(matchs!$AX35=\"\",\"\",matchs!$AX35)","v":""},{"$f":"IF(matchs!$BI35=\"\",\"\",matchs!$BI35)","v":""},{"$f":"IF(matchs!$BT35=\"\",\"\",matchs!$BT35)","v":""},"","","","","","","",null,null,null,null,null,null,null,null,null,null,"","",null,null,null,null,null,null,null,"","","","","","",null,""]
[30,{"$f":"IF(matchs!B36=\"\",\"\",matchs!B36)","v":""},{"$f":"IF(matchs!C36=\"\",\"\",matchs!C36)","v":0},{"$f":"IF(matchs!D36=\"\",\"\",matchs!D36)","v":0},{"$f":"IF(matchs!E36=\"\",\"\",matchs!E36)","v":0},{"$f":"IF(matchs!F36=\"\",\"\",matchs!F36)","v":8},{"$f":"IF(matchs!$EB36=\"\",\"\",matchs!$EB36)","v":30},null,null,null,"","","",null,"",{"$f":"IF(matchs!$Q36=\"\",\"\",matchs!$Q36)","v":""},{"$f":"IF(matchs!$AB36=\"\",\"\",matchs!$AB36)","v":""},{"$f":"IF(matchs!$AM36=\"\",\"\",matchs!$AM36)","v":""},{"$f":"IF(matchs!$AX36=\"\",\"\",matchs!$AX36)","v":""},{"$f":"IF(matchs!$BI36=\"\",\"\",matchs!$BI36)","v":""},{"$f":"IF(matchs!$BT36=\"\",\"\",matchs!$BT36)","v":""},"","","","","","",{"$f":"IF(COUNT(V40:AA40)<1,\"\",AVERAGE(V40:AA40))","v":""},null,null,null,null,null,null,null,null,null,null,"","",null,null,null,null,null,null,null,"","",{"$f":"IF(COUNT(M40,AB40,AN40,AW40)<1,\"\",SUM(M40,AB40,AN40,AW40))","v":""},{"$f":"IF(E40=\"G\",AX40,\"\")","v":""},{"$f":"IF(E40=\"F\",AX40,\"\")","v":""},"",null,{"$f":"IF(BA40=\"\",\"\",IF(BA40+BC$8>20,20,BA40+BC$8))","v":""}]
[31,{"$f":"IF(matchs!B37=\"\",\"\",matchs!B37)","v":""},{"$f":"IF(matchs!C37=\"\",\"\",matchs!C37)","v":0},{"$f":"IF(matchs!D37=\"\",\"\",matchs!D37)","v":0},{"$f":"IF(matchs!E37=\"\",\"\",matchs!E37)","v":0},{"$f":"IF(matchs!F37=\"\",\"\",matchs!F37)","v":8},{"$f":"IF(matchs!$EB37=\"\",\"\",matchs!$EB37)","v":30},null,null,null,"","","",null,"",{"$f":"IF(matchs!$Q37=\"\",\"\",matchs!$Q37)","v":""},{"$f":"IF(matchs!$AB37=\"\",\"\",matchs!$AB37)","v":""},{"$f":"IF(matchs!$AM37=\"\",\"\",matchs!$AM37)","v":""},{"$f":"IF(matchs!$AX37=\"\",\"\",matchs!$AX37)","v":""},{"$f":"IF(matchs!$BI37=\"\",\"\",matchs!$BI37)","v":""},{"$f":"IF(matchs!$BT37=\"\",\"\",matchs!$BT37)","v":""},"","","","","","",{"$f":"IF(COUNT(V41:AA41)<1,\"\",AVERAGE(V41:AA41))","v":""},null,null,null,null,null,null,null,null,null,null,"","",null,null,null,null,null,null,null,"","",{"$f":"IF(COUNT(M41,AB41,AN41,AW41)<1,\"\",SUM(M41,AB41,AN41,AW41))","v":""},{"$f":"IF(E41=\"G\",AX41,\"\")","v":""},{"$f":"IF(E41=\"F\",AX41,\"\")","v":""},"",null,{"$f":"IF(BA41=\"\",\"\",IF(BA41+BC$8>20,20,BA41+BC$8))","v":""}]
[32,{"$f":"IF(matchs!B38=\"\",\"\",matchs!B38)","v":""},{"$f":"IF(matchs!C38=\"\",\"\",matchs!C38)","v":0},{"$f":"IF(matchs!D38=\"\",\"\",matchs!D38)","v":0},{"$f":"IF(matchs!E38=\"\",\"\",matchs!E38)","v":0},{"$f":"IF(matchs!F38=\"\",\"\",matchs!F38)","v":0},{"$f":"IF(matchs!$EB38=\"\",\"\",matchs!$EB38)","v":""},null,null,null,"","","",null,"",{"$f":"IF(matchs!$Q38=\"\",\"\",matchs!$Q38)","v":""},{"$f":"IF(matchs!$AB38=\"\",\"\",matchs!$AB38)","v":""},{"$f":"IF(matchs!$AM38=\"\",\"\",matchs!$AM38)","v":""},{"$f":"IF(matchs!$AX38=\"\",\"\",matchs!$AX38)","v":""},{"$f":"IF(matchs!$BI38=\"\",\"\",matchs!$BI38)","v":""},{"$f":"IF(matchs!$BT38=\"\",\"\",matchs!$BT38)","v":""},"","","","","","",{"$f":"IF(COUNT(V42:AA42)<1,\"\",AVERAGE(V42:AA42))","v":""},null,null,null,null,null,null,null,null,null,null,"","",null,null,null,null,null,null,null,"","",{"$f":"IF(COUNT(M42,AB42,AN42,AW42)<1,\"\",SUM(M42,AB42,AN42,AW42))","v":""},{"$f":"IF(E42=\"G\",AX42,\"\")","v":""},{"$f":"IF(E42=\"F\",AX42,\"\")","v":""},"",null,{"$f":"IF(BA42=\"\",\"\",IF(BA42+BC$8>20,20,BA42+BC$8))","v":""}]
[33,{"$f":"IF(matchs!B39=\"\",\"\",matchs!B39)","v":""},{"$f":"IF(matchs!C39=\"\",\"\",matchs!C39)","v":""},{"$f":"IF(matchs!D39=\"\",\"\",matchs!D39)","v":""},{"$f":"IF(matchs!E39=\"\",\"\",matchs!E39)","v":""},{"$f":"IF(matchs!F39=\"\",\"\",matchs!F39)","v":""},{"$f":"IF(matchs!$EB39=\"\",\"\",matchs!$EB39)","v":""},null,null,null,"","","",null,"",{"$f":"IF(matchs!$Q39=\"\",\"\",matchs!$Q39)","v":""},{"$f":"IF(matchs!$AB39=\"\",\"\",matchs!$AB39)","v":""},{"$f":"IF(matchs!$AM39=\"\",\"\",matchs!$AM39)","v":""},{"$f":"IF(matchs!$AX39=\"\",\"\",matchs!$AX39)","v":""},{"$f":"IF(matchs!$BI39=\"\",\"\",matchs!$BI39)","v":""},{"$f":"IF(matchs!$BT39=\"\",\"\",matchs!$BT39)","v":""},"","","","","","",{"$f":"IF(COUNT(V43:AA43)<1,\"\",AVERAGE(V43:AA43))","v":""},null,null,null,null,null,null,null,null,null,null,"","",null,null,null,null,null,null,null,"","",{"$f":"IF(COUNT(M43,AB43,AN43,AW43)<1,\"\",SUM(M43,AB43,AN43,AW43))","v":""},{"$f":"IF(E43=\"G\",AX43,\"\")","v":""},{"$f":"IF(E43=\"F\",AX43,\"\")","v":""},"",null,{"$f":"IF(BA43=\"\",\"\",IF(BA43+BC$8>20,20,BA43+BC$8))","v":""}]
[34,{"$f":"IF(matchs!B40=\"\",\"\",matchs!B40)","v":""},{"$f":"IF(matchs!C40=\"\",\"\",matchs!C40)","v":""},{"$f":"IF(matchs!D40=\"\",\"\",matchs!D40)","v":""},{"$f":"IF(matchs!E40=\"\",\"\",matchs!E40)","v":""},{"$f":"IF(matchs!F40=\"\",\"\",matchs!F40)","v":""},{"$f":"IF(matchs!$EB40=\"\",\"\",matchs!$EB40)","v":""},null,null,null,"","","",null,"",{"$f":"IF(matchs!$Q40=\"\",\"\",matchs!$Q40)","v":""},{"$f":"IF(matchs!$AB40=\"\",\"\",matchs!$AB40)","v":""},{"$f":"IF(matchs!$AM40=\"\",\"\",matchs!$AM40)","v":""},{"$f":"IF(matchs!$AX40=\"\",\"\",matchs!$AX40)","v":""},{"$f":"IF(matchs!$BI40=\"\",\"\",matchs!$BI40)","v":""},{"$f":"IF(matchs!$BT40=\"\",\"\",matchs!$BT40)","v":""},"","","","","","","",null,null,null,null,null,null,null,null,null,null,"","",null,null,null,null,null,null,null,"","","","","","",null,""]
[35,{"$f":"IF(matchs!B41=\"\",\"\",matchs!B41)","v":""},{"$f":"IF(matchs!C41=\"\",\"\",matchs!C41)","v":""},{"$f":"IF(matchs!D41=\"\",\"\",matchs!D41)","v":""},{"$f":"IF(matchs!E41=\"\",\"\",matchs!E41)","v":""},{"$f":"IF(matchs!F41=\"\",\"\",matchs!F41)","v":""},{"$f":"IF(matchs!$EB41=\"\",\"\",matchs!$EB41)","v":""},null,null,null,"","","",null,"",{"$f":"IF(matchs!$Q41=\"\",\"\",matchs!$Q41)","v":""},{"$f":"IF(matchs!$AB41=\"\",\"\",matchs!$AB41)","v":""},{"$f":"IF(matchs!$AM41=\"\",\"\",matchs!$AM41)","v":""},{"$f":"IF(matchs!$AX41=\"\",\"\",matchs!$AX41)","v":""},{"$f":"IF(matchs!$BI41=\"\",\"\",matchs!$BI41)","v":""},{"$f":"IF(matchs!$BT41=\"\",\"\",matchs!$BT41)","v":""},"","","","","","","",null,null,null,null,null,null,null,null,null,null,"","",null,null,null,null,null,null,null,"","","","","","",null,""]
[36,{"$f":"IF(matchs!B42=\"\",\"\",matchs!B42)","v":""},{"$f":"IF(matchs!C42=\"\",\"\",matchs!C42)","v":""},{"$f":"IF(matchs!D42=\"\",\"\",matchs!D42)","v":""},{"$f":"IF(matchs!E42=\"\",\"\",matchs!E42)","v":""},{"$f":"IF(matchs!F42=\"\",\"\",matchs!F42)","v":""},{"$f":"IF(matchs!$EB42=\"\",\"\",matchs!$EB42)","v":""},null,null,null,"","","",null,"",{"$f":"IF(matchs!$Q42=\"\",\"\",matchs!$Q42)","v":""},{"$f":"IF(matchs!$AB42=\"\",\"\",matchs!$AB42)","v":""},{"$f":"IF(matchs!$AM42=\"\",\"\",matchs!$AM42)","v":""},{"$f":"IF(matchs!$AX42=\"\",\"\",matchs!$AX42)","v":""},{"$f":"IF(matchs!$BI42=\"\",\"\",matchs!$BI42)","v":""},{"$f":"IF(matchs!$BT42=\"\",\"\",matchs!$BT42)","v":""},"","","","","","","",null,null,null,null,null,null,null,null,null,null,"","",null,null,null,null,null,null,null,"","","","","","",null,""]
[37,{"$f":"IF(matchs!B43=\"\",\"\",matchs!B43)","v":""},{"$f":"IF(matchs!C43=\"\",\"\",matchs!C43)","v":""},{"$f":"IF(matchs!D43=\"\",\"\",matchs!D43)","v":""},{"$f":"IF(matchs!E43=\"\",\"\",matchs!E43)","v":""},{"$f":"IF(matchs!F43=\"\",\"\",matchs!F43)","v":""},{"$f":"IF(matchs!$EB43=\"\",\"\",matchs!$EB43)","v":""},null,null,null,"","","",null,"",{"$f":"IF(matchs!$Q43=\"\",\"\",matchs!$Q43)","v":""},{"$f":"IF(matchs!$AB43=\"\",\"\",matchs!$AB43)","v":""},{"$f":"IF(matchs!$AM43=\"\",\"\",matchs!$AM43)","v":""},{"$f":"IF(matchs!$AX43=\"\",\"\",matchs!$AX43)","v":""},{"$f":"IF(matchs!$BI43=\"\",\"\",matchs!$BI43)","v":""},{"$f":"IF(matchs!$BT43=\"\",\"\",matchs!$BT43)","v":""},"","","","","","","",null,null,null,null,null,null,null,null,null,null,"","",null,null,null,null,null,null,null,"","","","","","",null,""]
[38,{"$f":"IF(matchs!B44=\"\",\"\",matchs!B44)","v":""},{"$f":"IF(matchs!C44=\"\",\"\",matchs!C44)","v":""},{"$f":"IF(matchs!D44=\"\",\"\",matchs!D44)","v":""},{"$f":"IF(matchs!E44=\"\",\"\",matchs!E44)","v":""},{"$f":"IF(matchs!F44=\"\",\"\",matchs!F44)","v":""},{"$f":"IF(matchs!$EB44=\"\",\"\",matchs!$EB44)","v":""},null,null,null,"","","",null,"",{"$f":"IF(matchs!$Q44=\"\",\"\",matchs!$Q44)","v":""},{"$f":"IF(matchs!$AB44=\"\",\"\",matchs!$AB44)","v":""},{"$f":"IF(matchs!$AM44=\"\",\"\",matchs!$AM44)","v":""},{"$f":"IF(matchs!$AX44=\"\",\"\",matchs!$AX44)","v":""},{"$f":"IF(matchs!$BI44=\"\",\"\",matchs!$BI44)","v":""},{"$f":"IF(matchs!$BT44=\"\",\"\",matchs!$BT44)","v":""},"","","","","","","",null,null,null,null,null,null,null,null,null,null,"","",null,null,null,null,null,null,null,"","","","","","",null,""]
[null,null,null,null,null,null,null,null,null,null,null,null,null,null,null,null,{"$f":"IF(U49=\"\",\"\",\"Moyennes\")","v":"Moyennes"},null,{"$f":"IF(T49=\"\",\"\",\"G\")","v":"G"},{"$f":"IF(SUM(AY11:AY48)<1,\"\",AVERAGE(AY11:AY48))","v":2.25},{"$f":"IF(AL53=\"\",\"\",\"Notes mini et maxi\")","v":"Notes mini et maxi"},null,null,null,null,null,null,null,null,null,null,null,null,null,null,null,null,{"$f":"IF(U49=\"\",\"\",\"de\")","v":"de"},null,{"$f":"IF(T49=\"\",\"\",MIN(AY11:AY48))","v":1},{"$f":"IF(U49=\"\",\"\",\"à\")","v":"à"},{"$f":"IF(T49=\"\",\"\",MAX(AY11:AY48))","v":3.5},null,null,null,null,null,null,null,{"$f":"IF(AX11=\"\",\"\",AVERAGE(AX11:AX48))","v":2.25},null,null,{"$f":"IF(SUM(BA11:BA48)<1,\"\",AVERAGE(BA11:BA48))","v":2.25},null,{"$f":"IF(SUM(BC11:BC48)<1,\"\",AVERAGE(BC11:BC48))","v":2.25}]
[null,null,null,null,null,null,null,null,null,null,null,null,null,null,null,null,null,null,{"$f":"IF(T50=\"\",\"\",\"F\")","v":""},{"$f":"IF(SUM(AZ11:AZ48)<1,\"\",AVERAGE(AZ11:AZ48))","v":""},null,null,null,null,null,null,null,null,null,null,null,null,null,null,null,null,null,null,null,{"$f":"IF(T50=\"\",\"\",MIN(AZ11:AZ48))","v":""},null,{"$f":"IF(T50=\"\",\"\",MAX(AZ11:AZ48))","v":""}]
[null,0,"niveauG",null,"niveau",null,null,null,null,null,{"$f":"IF(H49=\"G\",1,\"\")","v":""},null,null,null,null,null,null,null,null,null,null,null,null,null,null,null,null,null,null,null,null,null,null,null,null,null,null,{"$f":"IF(S49=\"G\",1,\"\")","v":1},null,null,"place"]
[null,1,1,5,"A",null,null,null,null,null,{"$f":"IF(H50=\"F\",1,\"\")","v":""},null,null,null,null,null,null,null,null,null,null,null,null,null,null,null,null,null,null,null,null,null,null,null,null,null,null,{"$f":"IF(S50=\"F\",1,\"\")","v":""},null,null,null,null,null,null,null,null,null,null,null,null,null,null,null,null,-1]
[null,2,0,3.5,"B",null,null,null,null,null,{"$f":"IF(SUM(K51:K52)<1,\"\",SUM(K51:K52))","v":""},null,null,null,null,null,null,null,null,null,null,null,null,null,null,null,null,null,2,"DEG 1",0.5,4,null,null,null,null,null,{"$f":"IF(SUM(AL51:AL52)<1,\"\",SUM(AL51:AL52))","v":1},null,null,1,2,null,null,null,null,null,null,null,null,null,null,null,null,-0.75]
[null,3,2,7,"C",null,null,null,null,null,null,null,null,null,null,null,null,null,null,null,null,null,null,null,null,null,null,null,null,"DEG 2",1,null,null,null,null,null,null,null,null,null,2,1.8,null,null,null,null,null,null,null,null,null,null,null,null,-0.5]
[null,4,"poule",null,null,null,null,null,null,null,null,null,null,null,null,null,null,null,null,null,null,null,null,null,null,null,null,null,null,"DEG 3",1.5,null,null,null,null,null,null,null,null,null,3,1.7,null,null,null,null,null,null,null,null,null,null,null,null,-0.25]
[null,null,1,2,null,null,null,null,null,null,null,null,null,null,null,null,null,null,null,null,null,null,null,null,null,null,null,null,null,"DEG 4",2,null,null,null,null,null,null,null,null,null,4,1.6]
[null,null,2,0,null,null,null,null,null,null,null,null,null,null,null,null,null,null,null,null,null,null,null,null,null,null,null,null,null,null,null,null,null,null,null,null,null,null,null,null,5,1.5,null,null,null,null,null,null,null,null,null,null,null,null,0.25]
[null,null,3,null,null,null,null,null,null,null,null,null,null,null,null,null,null,null,null,null,null,null,null,null,null,null,null,null,null,null,null,null,null,null,null,null,null,null,null,null,6,1.4,null,null,null,null,null,null,null,null,null,null,null,null,0.5]
[null,null,null,null,null,null,null,null,null,null,null,null,null,null,null,null,null,null,null,null,null,null,null,null,null,null,null,null,null,null,null,null,null,null,null,null,null,null,null,null,7,1.3,null,null,null,null,null,null,null,null,null,null,null,null,0.75]
[null,null,"classement",null,null,null,null,null,null,null,null,null,null,null,null,null,null,null,null,null,null,null,null,null,null,null,null,null,null,null,null,null,null,null,null,null,null,null,null,null,8,1.2,null,null,null,null,null,null,null,null,null,null,null,null,1]
[null,null,1,2,null,null,null,null,null,null,null,null,null,null,null,null,null,null,null,null,null,null,null,null,null,null,null,null,null,null,null,null,null,null,null,null,null,null,null,null,9,1.1000000000000001]
[null,null,2,1.5,null,null,null,null,null,null,null,null,null,null,null,null,null,null,null,null,null,null,null,null,null,null,null,null,null,null,null,null,null,null,null,null,null,-0.5,null,null,10,0.999999999999999]
[null,null,3,1.25,null,null,null,null,null,null,null,null,null,null,null,null,null,null,null,null,null,null,null,null,null,null,null,null,null,null,null,null,null,null,null,null,null,-0.25,null,null,11,0.89999999999999902]
[null,null,4,1,null,null,null,null,null,null,null,null,null,null,null,null,null,null,null,null,null,null,null,null,null,null,null,null,null,null,null,null,null,null,null,null,null,0.25,null,null,12,0.8]
[null,null,5,0.75,null,null,null,null,null,null,null,null,null,null,null,null,null,null,null,null,null,null,null,null,null,null,null,null,null,null,null,null,null,null,null,null,null,0.5,null,null,13,0.7]
[null,null,6,0.5,null,null,null,null,null,null,null,null,null,null,null,null,null,null,null,null,null,null,null,null,null,null,null,null,null,null,null,null,null,null,null,null,null,null,null,null,14,0.6,null,null,null,null,null,null,null,null,null,null,null,null,{"$f":"IF(SUM(BC11:BC50)<1,\"\",AVERAGE(BC11:BC50))","v":2.25}]
[null,null,7,0.25,null,null,null,null,null,null,null,null,null,null,null,null,null,"a","b","c","d",null,null,null,null,null,null,null,null,null,null,null,null,null,null,null,null,null,null,null,15,0.5]
[null,null,8,0,null,null,null,"<<4","Ninfinf4",null,"cas1",null,"Deg 1",null,"A",null,"cas1",1.5,1.5,1.5,1.5,null,null,null,null,null,null,null,null,null,null,null,null,null,null,null,null,null,null,null,16,0.4]
[null,null,"G",0,null,null,null,"<4","Ninf4",null,"cas2",null,"Deg 2",null,"B",null,"cas2",2,2,2,2,null,null,null,null,null,null,null,null,null,null,null,null,null,null,null,null,null,null,null,17,0.3]
[null,null,"F",1,null,null,null,4,"N_4",null,"cas3",null,"Deg 3",null,"C",null,"cas3",2.5,2.5,2.5,2.5,null,null,null,null,null,null,null,null,null,null,null,null,null,null,null,null,null,null,null,18,0.2]
[null,null,null,null,null,null,null,"4+","Nsup4",null,"cas4",null,"Deg 4",null,"D",null,"cas4",3,3,3,3,null,null,null,null,null,null,null,null,null,null,null,null,null,null,null,null,null,null,null,19,0.1]
[null,null,0,2,null,null,null,"4++","Nsupsup4",null,"cas5",null,null,null,null,null,"cas5",3.5,3.5,3.5,3.5,null,null,null,null,null,null,null,null,null,null,null,null,null,null,null,null,null,null,null,20,0]
[null,null,"0+",3.5,null,null,null,null,null,null,"cas6",null,null,null,null,null,"cas6",4,4,4,4]
[null,null,1,5]
[null,null,"1+",7,null,null,null,null,null,null,null,null,null,null,null,null,null,null,null,null,null,null,null,null,null,null,null,null,null,null,null,null,null,null,null,null,null,null,null,null,null,-1]
[null,null,2,8.5,null,null,null,null,null,null,null,null,null,null,null,null,null,null,null,null,null,null,null,null,null,null,null,null,null,null,null,null,null,null,null,null,null,null,null,null,null,-0.75]
[null,null,"2+",10,null,null,null,"<<4","<4",null,4,"4+","4++",null,null,null,null,null,null,null,null,null,null,null,null,null,null,null,null,null,null,null,null,null,null,null,null,null,null,null,null,-0.5]
[null,null,null,null,null,"ajustement",null,2,4,null,6,8,9,null,null,null,null,null,null,null,null,null,null,null,null,null,null,null,null,null,null,null,null,null,null,null,null,null,null,null,null,-0.25]
[null,null,"analyse",null,null,null,null,null,null,null,null,null,null,null,null,null,null,null,null,null,null,null,null,null,null,null,null,null,null,null,null,null,null,null,null,null,null,null,null,null,null,0.25]
[null,null,"DEG 1",0.5,{"$f":"-0.4","v":-0.4},{"$f":"-0.5","v":-0.5},{"$f":"-0.5","v":-0.5},-2,-1,null,-1,-0.5,0.2,null,null,"nbre g","G","a","B","C","D",null,null,null,null,null,null,null,null,null,null,null,null,null,null,null,null,null,null,null,null,0.5]
[null,null,"DEG 2",1,{"$f":"-0.2","v":-0.2},{"$f":"-0.25","v":-0.25},{"$f":"-0.25","v":-0.25},-1.5,-0.5,null,-0.5,-0.25,0.4,null,null,null,0,-1.5,-1.5,-1.5,-3,null,null,null,null,null,null,null,null,null,null,null,null,null,null,null,null,null,null,null,null,0.75]
[null,null,"DEG 3",1.5,0,0,0,-1,-0.25,null,0.5,0.25,0.5,null,null,null,1,-1,-1,-1,-2,null,null,null,null,null,null,null,null,null,null,null,null,null,null,null,null,null,null,null,null,1]
[null,null,"DEG 4",2,0.2,0.25,0.25,-0.5,0.25,null,1,0.5,0.6,null,null,null,2,-0.5,-0.5,-0.5,-1]
[null,null,null,2.5,0.4,0.5,0.5,0.5,0.5,null,1.5,0.75,0.8,null,null,null,3,0,0,0,0]
[null,null,null,3,null,0.75,null,1,0.75,null,1.75,1,1,null,null,null,4,0,0,0,0]
[null,null,"badminton",null,null,1]
[null,null,"badminton (G)"]
[null,null,"badminton (F)"]
[]
[]
[null,null,{"$f":"IF('mise à jour des données'!A3=\"\",\"\",'mise à jour des données'!A3)","v":"S’engager et réaliser des actions techniques d’attaque et de défense en relation avec son projet de jeu"},{"$f":"IF('mise à jour des données'!C3=\"\",\"\",'mise à jour des données'!C3)","v":"badminton"},{"$f":"IF('mise à jour des données'!D3=\"\",\"\",'mise à jour des données'!D3)","v":1},{"$f":"IF('mise à jour des données'!E3=\"\",\"\",'mise à jour des données'!E3)","v":"*De nombreuses fautes : maladresse,Prise de raquette inadaptée.Pas de coup préférentiel efficace : techniques rudimentaires.\nLe service est une simple mise en jeu, le coude en préparation se situe la plupart du temps toujours vers l’avant du corps.\nPeu ou pas de déplacements\n*Utilisation efficace d’un coup préférentiel.L’élève joue de face le plus souvent en frappe haute.Le   service   neutralise  l’attaque\nAdverse ou l’élève a des intentions au service sans forcément y parvenir.Il construit et marque grâce à des renvois dans l’axe central essentiellement.déplacements limités.rupture par des trajectoires variées et accélérées. (smashs, dégagement, amorti) sans y parvenir à chaque fois.\n*Il utilise un ou 2 coups prioritaires efficaces.Variété des services utilisés (vitesses ou longueur /position adverse)frappe de profil\nJoue latéralité ou  profondeur,Déplacements et placements efficaces si peu de pression\n*Frappes de profil, frappes variées et efficaces, déplacements rapides et replacements systématiques.\nVitesse, précision, anticipation, pertinence, coups masqués, construction et équilibre, rapidité, précocité des déplacements."}]
[null,null,{"$f":"IF('mise à jour des données'!#REF!=\"\",\"\",'mise à jour des données'!#REF!)","v":{"$error":"#REF!"}},{"$f":"IF('mise à jour des données'!#REF!=\"\",\"\",'mise à jour des données'!#REF!)","v":{"$error":"#REF!"}},{"$f":"IF('mise à jour des données'!#REF!=\"\",\"\",'mise à jour des données'!#REF!)","v":{"$error":"#REF!"}},{"$f":"IF('mise à jour des données'!#REF!=\"\",\"\",'mise à jour des données'!#REF!)","v":{"$error":"#REF!"}}]
[null,null,{"$f":"IF('mise à jour des données'!#REF!=\"\",\"\",'mise à jour des données'!#REF!)","v":{"$error":"#REF!"}},{"$f":"IF('mise à jour des données'!#REF!=\"\",\"\",'mise à jour des données'!#REF!)","v":{"$error":"#REF!"}},{"$f":"IF('mise à jour des données'!#REF!=\"\",\"\",'mise à jour des données'!#REF!)","v":{"$error":"#REF!"}},{"$f":"IF('mise à jour des données'!#REF!=\"\",\"\",'mise à jour des données'!#REF!)","v":{"$error":"#REF!"}}]
[]
[null,null,{"$f":"IF('mise à jour des données'!F3=\"\",\"\",'mise à jour des données'!F3)","v":"Technique et tactique"},{"$f":"IF('mise à jour des données'!G3=\"\",\"\",'mise à jour des données'!G3)","v":"badminton (entrée bio-énerGétique)"},{"$f":"IF('mise à jour des données'!H3=\"\",\"\",'mise à jour des données'!H3)","v":1},{"$f":"IF('mise à jour des données'!J3=\"\",\"\",'mise à jour des données'!J3)","v":""},null,null,-1.5]
[null,null,{"$f":"IF('mise à jour des données'!#REF!=\"\",\"\",'mise à jour des données'!#REF!)","v":{"$error":"#REF!"}},{"$f":"IF('mise à jour des données'!#REF!=\"\",\"\",'mise à jour des données'!#REF!)","v":{"$error":"#REF!"}},{"$f":"IF('mise à jour des données'!#REF!=\"\",\"\",'mise à jour des données'!#REF!)","v":{"$error":"#REF!"}},{"$f":"IF('mise à jour des données'!#REF!=\"\",\"\",'mise à jour des données'!#REF!)","v":{"$error":"#REF!"}},null,null,-1]
[null,null,{"$f":"IF('mise à jour des données'!#REF!=\"\",\"\",'mise à jour des données'!#REF!)","v":{"$error":"#REF!"}},{"$f":"IF('mise à jour des données'!#REF!=\"\",\"\",'mise à jour des données'!#REF!)","v":{"$error":"#REF!"}},{"$f":"IF('mise à jour des données'!#REF!=\"\",\"\",'mise à jour des données'!#REF!)","v":{"$error":"#REF!"}},{"$f":"IF('mise à jour des données'!#REF!=\"\",\"\",'mise à jour des données'!#REF!)","v":{"$error":"#REF!"}},null,null,-0.5]
[null,null,null,null,null,null,null,null,0]
[null,null,{"$f":"IF('mise à jour des données'!K3=\"\",\"\",'mise à jour des données'!K3)","v":"Technique et tactique"},{"$f":"IF('mise à jour des données'!L3=\"\",\"\",'mise à jour des données'!L3)","v":"badminton (entrée bio-énerGétique)"},null,{"$f":"IF('mise à jour des données'!O3=\"\",\"\",'mise à jour des données'!O3)","v":""},null,null,0.5]
[null,null,{"$f":"IF('mise à jour des données'!#REF!=\"\",\"\",'mise à jour des données'!#REF!)","v":{"$error":"#REF!"}},{"$f":"IF('mise à jour des données'!#REF!=\"\",\"\",'mise à jour des données'!#REF!)","v":{"$error":"#REF!"}},null,{"$f":"IF('mise à jour des données'!#REF!=\"\",\"\",'mise à jour des données'!#REF!)","v":{"$error":"#REF!"}},null,null,0.75]
[null,null,{"$f":"IF('mise à jour des données'!#REF!=\"\",\"\",'mise à jour des données'!#REF!)","v":{"$error":"#REF!"}},{"$f":"IF('mise à jour des données'!#REF!=\"\",\"\",'mise à jour des données'!#REF!)","v":{"$error":"#REF!"}},null,{"$f":"IF('mise à jour des données'!#REF!=\"\",\"\",'mise à jour des données'!#REF!)","v":{"$error":"#REF!"}},null,null,1]

{"sheet":"mise à jour des données","index":4,"n_rows":4,"n_cols":15,"rows_kept":4,"cut":false,"hidden":false,"merged":[]}
[null,null,null,null,"IMPORTANT: Dans chaque cadre il doit y avoir 5 lignes (1 ligne par niveau).\nPour aller à la ligne, appuyer sur les touches \"Alt\" et \"Entrée\" du clavier.\nNe pas changer la largeur des colonnes !",null,null,null,null,"IMPORTANT: Dans chaque cadre il doit y avoir 5 lignes (1 ligne par niveau).\nPour aller à la ligne, appuyer sur les touches \"Alt\" et \"Entrée\" du clavier.\nNe pas changer la largeur des colonnes !",null,null,null,null,"IMPORTANT: Dans chaque cadre il doit y avoir 5 lignes (1 ligne par niveau).\nPour aller à la ligne, appuyer sur les touches \"Alt\" et \"Entrée\" du clavier.\nNe pas changer la largeur des colonnes !"]
[null,null,null,null,"badminton",null,null,null,null,"badminton (entrée bio-énerGétique)",null,null,null,null,"badminton (entrée bio-inFormationnelle)"]
["S’engager et réaliser des actions techniques d’attaque et de défense en relation avec son projet de jeu","DEG 1\n\n\nDEG 2\n\n\n\nDEG 3\n\nDEG 4",{"$f":"$E$2","v":"badminton"},1,"*De nombreuses fautes : maladresse,Prise de raquette inadaptée.Pas de coup préférentiel efficace : techniques rudimentaires.\nLe service est une simple mise en jeu, le coude en préparation se situe la plupart du temps toujours vers l’avant du corps.\nPeu ou pas de déplacements\n*Utilisation efficace d’un coup préférentiel.L’élève joue de face le plus souvent en frappe haute.Le   service   neutralise  l’attaque\nAdverse ou l’élève a des intentions au service sans forcément y parvenir.Il construit et marque grâce à des renvois dans l’axe central essentiellement.déplacements limités.rupture par des trajectoires variées et accélérées. (smashs, dégagement, amorti) sans y parvenir à chaque fois.\n*Il utilise un ou 2 coups prioritaires efficaces.Variété des services utilisés (vitesses ou longueur /position adverse)frappe de profil\nJoue latéralité ou  profondeur,Déplacements et placements efficaces si peu de pression\n*Frappes de profil, frappes variées et efficaces, déplacements rapides et replacements systématiques.\nVitesse, précision, anticipation, pertinence, coups masqués, construction et équilibre, rapidité, précocité des déplacements.","Technique et tactique",{"$f":"$J$2","v":"badminton (entrée bio-énerGétique)"},1,"<<4\n<4\n4\n4+\n4++",null,"Technique et tactique",{"$f":"$J$2","v":"badminton (entrée bio-énerGétique)"},1,"<<4\n<4\n4\n4+\n4++"]
["Faire des choix au regard de l’analyse du rapport de force\net engagement dans le duel.","cas6\ncas5\ncas4\ncas3\ncas2\ncas1",null,null,"Gagne les 2 sets en augmentant l’écart sur le second set\nGagne les 2 sets avec dans le 2ème set un écart de pts inférieur ou égal à celui du 1er set\nGagne le second set après avoir perdu le 1er\nPerd le second set après avoir gagné le 1er\nPerd les 2 sets  en réduisant l’écart d’au moins 2 pts sur le second set\nPerd les 2 sets sans évolution positive du score sur le second set ","Efficacité des choix stratégiques\net engagement dans le duel.","cas1\ncas2\ncas3\ncas4\ncas5\ncas6",null,"cas1\ncas2\ncas3\ncas4\ncas5\ncas6","Gagne les 2 sets en augmentant l’écart sur le second set\nGagne les 2 sets avec dans le 2ème set un écart de pts inférieur ou égal à celui du 1er set\nGagne le second set après avoir perdu le 1er\nPerd le second set après avoir gagné le 1er\nPerd les 2 sets  en réduisant l’écart d’au moins 2 pts sur le second set\nPerd les 2 sets sans évolution positive du score sur le second set ","Efficacité des choix stratégiques\net engagement dans le duel.","cas1\ncas2\ncas3\ncas4\ncas5\ncas6",null,"cas1\ncas2\ncas3\ncas4\ncas5\ncas6","Gagne les 2 sets en augmentant l’écart sur le second set\nGagne les 2 sets avec dans le 2ème set un écart de pts inférieur ou égal à celui du 1er set\nGagne le second set après avoir perdu le 1er\nPerd le second set après avoir gagné le 1er\nPerd les 2 sets  en réduisant l’écart d’au moins 2 pts sur le second set\nPerd les 2 sets sans évolution positive du score sur le second set "]